hadoop-hive-dev mailing list archives

Site index · List index
Message view « Date » · « Thread »
Top « Date » · « Thread »
From mvaradach...@facebook.com (Murli Varadachari)
Subject *UNIT TEST FAILURE for apache HIVE* Hadoop.Version=0.17.1 based on SVN Rev# 732161.8
Date Tue, 06 Jan 2009 22:45:10 GMT
init:

download-ivy:

init-ivy:

settings-ivy:

resolve:
:: loading settings :: file = /usr/local/continuous_builds/src/hiveopensource-0.17.1/hiveopensource_0_17_1/ivy/ivysettings.xml
[ivy:retrieve] :: resolving dependencies :: org.apache.hadoop.hive#ant;working@devbuild001.snc1.facebook.com
[ivy:retrieve] 	confs: [default]
[ivy:retrieve] :: resolution report :: resolve 100ms :: artifacts dl 0ms
	---------------------------------------------------------------------
	|                  |            modules            ||   artifacts   |
	|       conf       | number| search|dwnlded|evicted|| number|dwnlded|
	---------------------------------------------------------------------
	|      default     |   0   |   0   |   0   |   0   ||   0   |   0   |
	---------------------------------------------------------------------
[ivy:retrieve] :: retrieving :: org.apache.hadoop.hive#ant
[ivy:retrieve] 	confs: [default]
[ivy:retrieve] 	0 artifacts copied, 0 already retrieved (0kB/3ms)

install-hadoopcore:

compile:
     [echo] Compiling: anttasks

jar:
     [copy] Copying 1 file to /usr/local/continuous_builds/src/hiveopensource-0.17.1/hiveopensource_0_17_1/build/anttasks/classes/org/apache/hadoop/hive/ant
      [jar] Building jar: /usr/local/continuous_builds/src/hiveopensource-0.17.1/hiveopensource_0_17_1/build/anttasks/hive_anttasks.jar

deploy:
     [echo] hive: anttasks
     [copy] Copying 1 file to /usr/local/continuous_builds/src/hiveopensource-0.17.1/hiveopensource_0_17_1/build

configure:
     [copy] Copying 239 files to /usr/local/continuous_builds/src/hiveopensource-0.17.1/hiveopensource_0_17_1/build/ql/java

compile:
     [echo] Compiling: ql
    [javac] Compiling 241 source files to /usr/local/continuous_builds/src/hiveopensource-0.17.1/hiveopensource_0_17_1/build/ql/classes
    [javac] Note: Some input files use or override a deprecated API.
    [javac] Note: Recompile with -Xlint:deprecation for details.
    [javac] Note: Some input files use unchecked or unsafe operations.
    [javac] Note: Recompile with -Xlint:unchecked for details.

jar:
     [echo] Jar: ql
    [unzip] Expanding: /usr/local/continuous_builds/src/hiveopensource-0.17.1/hiveopensource_0_17_1/ql/lib/commons-jexl-1.1.jar
into /usr/local/continuous_builds/src/hiveopensource-0.17.1/hiveopensource_0_17_1/build/jexl/classes
    [unzip] Expanding: /usr/local/continuous_builds/src/hiveopensource-0.17.1/hiveopensource_0_17_1/lib/libthrift.jar
into /usr/local/continuous_builds/src/hiveopensource-0.17.1/hiveopensource_0_17_1/build/thrift/classes
    [unzip] Expanding: /usr/local/continuous_builds/src/hiveopensource-0.17.1/hiveopensource_0_17_1/lib/commons-lang-2.4.jar
into /usr/local/continuous_builds/src/hiveopensource-0.17.1/hiveopensource_0_17_1/build/commons-lang/classes
      [jar] Building jar: /usr/local/continuous_builds/src/hiveopensource-0.17.1/hiveopensource_0_17_1/build/ql/hive_exec.jar

deploy:
     [echo] hive: ql
     [copy] Copying 1 file to /usr/local/continuous_builds/src/hiveopensource-0.17.1/hiveopensource_0_17_1/build

init:
    [mkdir] Created dir: /usr/local/continuous_builds/src/hiveopensource-0.17.1/hiveopensource_0_17_1/build/cli
    [mkdir] Created dir: /usr/local/continuous_builds/src/hiveopensource-0.17.1/hiveopensource_0_17_1/build/cli/classes
    [mkdir] Created dir: /usr/local/continuous_builds/src/hiveopensource-0.17.1/hiveopensource_0_17_1/build/cli/test
    [mkdir] Created dir: /usr/local/continuous_builds/src/hiveopensource-0.17.1/hiveopensource_0_17_1/build/cli/test/src
    [mkdir] Created dir: /usr/local/continuous_builds/src/hiveopensource-0.17.1/hiveopensource_0_17_1/build/cli/test/classes

download-ivy:

init-ivy:

settings-ivy:

resolve:
:: loading settings :: file = /usr/local/continuous_builds/src/hiveopensource-0.17.1/hiveopensource_0_17_1/ivy/ivysettings.xml
[ivy:retrieve] :: resolving dependencies :: org.apache.hadoop.hive#cli;working@devbuild001.snc1.facebook.com
[ivy:retrieve] 	confs: [default]
[ivy:retrieve] 	found hadoop#core;0.17.1 in hadoop-resolver
[ivy:retrieve] :: resolution report :: resolve 67ms :: artifacts dl 2ms
	---------------------------------------------------------------------
	|                  |            modules            ||   artifacts   |
	|       conf       | number| search|dwnlded|evicted|| number|dwnlded|
	---------------------------------------------------------------------
	|      default     |   1   |   0   |   0   |   0   ||   1   |   0   |
	---------------------------------------------------------------------
[ivy:retrieve] :: retrieving :: org.apache.hadoop.hive#cli
[ivy:retrieve] 	confs: [default]
[ivy:retrieve] 	0 artifacts copied, 1 already retrieved (0kB/4ms)

install-hadoopcore:

compile:
     [echo] Compiling: cli
    [javac] Compiling 5 source files to /usr/local/continuous_builds/src/hiveopensource-0.17.1/hiveopensource_0_17_1/build/cli/classes
    [javac] Note: /usr/local/continuous_builds/src/hiveopensource-0.17.1/hiveopensource_0_17_1/cli/src/java/org/apache/hadoop/hive/cli/OptionsProcessor.java
uses unchecked or unsafe operations.
    [javac] Note: Recompile with -Xlint:unchecked for details.

jar:
     [echo] Jar: cli
      [jar] Building jar: /usr/local/continuous_builds/src/hiveopensource-0.17.1/hiveopensource_0_17_1/build/cli/hive_cli.jar

deploy:
     [echo] hive: cli
     [copy] Copying 1 file to /usr/local/continuous_builds/src/hiveopensource-0.17.1/hiveopensource_0_17_1/build

init:
    [mkdir] Created dir: /usr/local/continuous_builds/src/hiveopensource-0.17.1/hiveopensource_0_17_1/build/service
    [mkdir] Created dir: /usr/local/continuous_builds/src/hiveopensource-0.17.1/hiveopensource_0_17_1/build/service/classes
    [mkdir] Created dir: /usr/local/continuous_builds/src/hiveopensource-0.17.1/hiveopensource_0_17_1/build/service/test
    [mkdir] Created dir: /usr/local/continuous_builds/src/hiveopensource-0.17.1/hiveopensource_0_17_1/build/service/test/src
    [mkdir] Created dir: /usr/local/continuous_builds/src/hiveopensource-0.17.1/hiveopensource_0_17_1/build/service/test/classes

core-compile:
    [javac] Compiling 6 source files to /usr/local/continuous_builds/src/hiveopensource-0.17.1/hiveopensource_0_17_1/build/service/classes

compile:

jar:
     [echo] Jar: service
      [jar] Building jar: /usr/local/continuous_builds/src/hiveopensource-0.17.1/hiveopensource_0_17_1/build/service/hive_service.jar

deploy:
     [echo] hive: service
     [copy] Copying 1 file to /usr/local/continuous_builds/src/hiveopensource-0.17.1/hiveopensource_0_17_1/build

init:
    [mkdir] Created dir: /usr/local/continuous_builds/src/hiveopensource-0.17.1/hiveopensource_0_17_1/build/jdbc
    [mkdir] Created dir: /usr/local/continuous_builds/src/hiveopensource-0.17.1/hiveopensource_0_17_1/build/jdbc/classes
    [mkdir] Created dir: /usr/local/continuous_builds/src/hiveopensource-0.17.1/hiveopensource_0_17_1/build/jdbc/test
    [mkdir] Created dir: /usr/local/continuous_builds/src/hiveopensource-0.17.1/hiveopensource_0_17_1/build/jdbc/test/src
    [mkdir] Created dir: /usr/local/continuous_builds/src/hiveopensource-0.17.1/hiveopensource_0_17_1/build/jdbc/test/classes

core-compile:
    [javac] Compiling 10 source files to /usr/local/continuous_builds/src/hiveopensource-0.17.1/hiveopensource_0_17_1/build/jdbc/classes
    [javac] Note: Some input files use or override a deprecated API.
    [javac] Note: Recompile with -Xlint:deprecation for details.

compile:

jar:
     [echo] Jar: jdbc
      [jar] Building jar: /usr/local/continuous_builds/src/hiveopensource-0.17.1/hiveopensource_0_17_1/build/jdbc/hive_jdbc.jar

deploy:
     [echo] hive: jdbc
     [copy] Copying 1 file to /usr/local/continuous_builds/src/hiveopensource-0.17.1/hiveopensource_0_17_1/build

package:
     [echo] Deploying Hive jars to /usr/local/continuous_builds/src/hiveopensource-0.17.1/hiveopensource_0_17_1/build/dist
    [mkdir] Created dir: /usr/local/continuous_builds/src/hiveopensource-0.17.1/hiveopensource_0_17_1/build/dist
    [mkdir] Created dir: /usr/local/continuous_builds/src/hiveopensource-0.17.1/hiveopensource_0_17_1/build/dist/lib
    [mkdir] Created dir: /usr/local/continuous_builds/src/hiveopensource-0.17.1/hiveopensource_0_17_1/build/dist/conf
    [mkdir] Created dir: /usr/local/continuous_builds/src/hiveopensource-0.17.1/hiveopensource_0_17_1/build/dist/bin
    [mkdir] Created dir: /usr/local/continuous_builds/src/hiveopensource-0.17.1/hiveopensource_0_17_1/build/dist/examples
    [mkdir] Created dir: /usr/local/continuous_builds/src/hiveopensource-0.17.1/hiveopensource_0_17_1/build/dist/examples/files
    [mkdir] Created dir: /usr/local/continuous_builds/src/hiveopensource-0.17.1/hiveopensource_0_17_1/build/dist/examples/queries
    [mkdir] Created dir: /usr/local/continuous_builds/src/hiveopensource-0.17.1/hiveopensource_0_17_1/build/dist/lib/py
    [mkdir] Created dir: /usr/local/continuous_builds/src/hiveopensource-0.17.1/hiveopensource_0_17_1/build/dist/lib/php
     [copy] Copying 1 file to /usr/local/continuous_builds/src/hiveopensource-0.17.1/hiveopensource_0_17_1/build/dist/bin
     [copy] Copying 5 files to /usr/local/continuous_builds/src/hiveopensource-0.17.1/hiveopensource_0_17_1/build/dist/bin/ext
     [copy] Copying 1 file to /usr/local/continuous_builds/src/hiveopensource-0.17.1/hiveopensource_0_17_1/build/dist/bin
     [copy] Copying 1 file to /usr/local/continuous_builds/src/hiveopensource-0.17.1/hiveopensource_0_17_1/build/dist/conf
     [copy] Copying 1 file to /usr/local/continuous_builds/src/hiveopensource-0.17.1/hiveopensource_0_17_1/build/dist/conf
     [copy] Copying 1 file to /usr/local/continuous_builds/src/hiveopensource-0.17.1/hiveopensource_0_17_1/build/dist/conf
     [copy] Copying 6 files to /usr/local/continuous_builds/src/hiveopensource-0.17.1/hiveopensource_0_17_1/build/dist/lib/php
     [copy] Copying 12 files to /usr/local/continuous_builds/src/hiveopensource-0.17.1/hiveopensource_0_17_1/build/dist/lib/py
     [copy] Copied 3 empty directories to 1 empty directory under /usr/local/continuous_builds/src/hiveopensource-0.17.1/hiveopensource_0_17_1/build/dist/lib/py
     [copy] Copying 37 files to /usr/local/continuous_builds/src/hiveopensource-0.17.1/hiveopensource_0_17_1/build/dist/lib
     [copy] Copying 16 files to /usr/local/continuous_builds/src/hiveopensource-0.17.1/hiveopensource_0_17_1/build/dist/examples/files
     [copy] Copying 1 file to /usr/local/continuous_builds/src/hiveopensource-0.17.1/hiveopensource_0_17_1/build/dist
     [copy] Copying 41 files to /usr/local/continuous_builds/src/hiveopensource-0.17.1/hiveopensource_0_17_1/build/dist/examples/queries

BUILD SUCCESSFUL
Total time: 1 minute 13 seconds
RUNNING TEST FOR HIVE OPENSOURCE - ant test
+++++++++++++++++++++++++++++++++++++++++++++++++++++++++++++++++
Buildfile: build.xml

clean-test:

clean-test:
   [delete] Deleting directory /usr/local/continuous_builds/src/hiveopensource-0.17.1/hiveopensource_0_17_1/build/cli/test

clean-test:
   [delete] Deleting directory /usr/local/continuous_builds/src/hiveopensource-0.17.1/hiveopensource_0_17_1/build/common/test

clean-test:
   [delete] Deleting directory /usr/local/continuous_builds/src/hiveopensource-0.17.1/hiveopensource_0_17_1/build/jdbc/test

clean-test:
   [delete] Deleting directory /usr/local/continuous_builds/src/hiveopensource-0.17.1/hiveopensource_0_17_1/build/metastore/test
Overriding previous definition of reference to test.classpath

clean-test:
   [delete] Deleting directory /usr/local/continuous_builds/src/hiveopensource-0.17.1/hiveopensource_0_17_1/build/ql/test

clean-test:
   [delete] Deleting directory /usr/local/continuous_builds/src/hiveopensource-0.17.1/hiveopensource_0_17_1/build/serde/test

clean-test:
   [delete] Deleting directory /usr/local/continuous_builds/src/hiveopensource-0.17.1/hiveopensource_0_17_1/build/service/test

BUILD SUCCESSFUL
Total time: 7 seconds
Buildfile: build.xml

clean-test:

clean-test:

clean-test:

clean-test:

clean-test:
Overriding previous definition of reference to test.classpath

clean-test:

clean-test:

clean-test:

deploy:

init:
    [mkdir] Created dir: /usr/local/continuous_builds/src/hiveopensource-0.17.1/hiveopensource_0_17_1/build/common/test
    [mkdir] Created dir: /usr/local/continuous_builds/src/hiveopensource-0.17.1/hiveopensource_0_17_1/build/common/test/src
    [mkdir] Created dir: /usr/local/continuous_builds/src/hiveopensource-0.17.1/hiveopensource_0_17_1/build/common/test/classes

download-ivy:

init-ivy:

settings-ivy:

resolve:
[ivy:retrieve] :: Ivy 2.0.0-rc2 - 20081028224207 :: http://ant.apache.org/ivy/ ::
:: loading settings :: file = /usr/local/continuous_builds/src/hiveopensource-0.17.1/hiveopensource_0_17_1/ivy/ivysettings.xml
[ivy:retrieve] :: resolving dependencies :: org.apache.hadoop.hive#common;working@devbuild001.snc1.facebook.com
[ivy:retrieve] 	confs: [default]
[ivy:retrieve] 	found hadoop#core;0.17.1 in hadoop-resolver
[ivy:retrieve] :: resolution report :: resolve 96ms :: artifacts dl 4ms
	---------------------------------------------------------------------
	|                  |            modules            ||   artifacts   |
	|       conf       | number| search|dwnlded|evicted|| number|dwnlded|
	---------------------------------------------------------------------
	|      default     |   1   |   0   |   0   |   0   ||   1   |   0   |
	---------------------------------------------------------------------
[ivy:retrieve] :: retrieving :: org.apache.hadoop.hive#common
[ivy:retrieve] 	confs: [default]
[ivy:retrieve] 	0 artifacts copied, 1 already retrieved (0kB/5ms)

install-hadoopcore:

compile:
     [echo] Compiling: common

jar:
     [echo] Jar: common

deploy:
     [echo] hive: common

init:
    [mkdir] Created dir: /usr/local/continuous_builds/src/hiveopensource-0.17.1/hiveopensource_0_17_1/build/serde/test
    [mkdir] Created dir: /usr/local/continuous_builds/src/hiveopensource-0.17.1/hiveopensource_0_17_1/build/serde/test/src
    [mkdir] Created dir: /usr/local/continuous_builds/src/hiveopensource-0.17.1/hiveopensource_0_17_1/build/serde/test/classes

dynamic-serde:

compile:
     [echo] Compiling: serde

jar:
     [echo] Jar: serde

deploy:
     [echo] hive: serde

init:
    [mkdir] Created dir: /usr/local/continuous_builds/src/hiveopensource-0.17.1/hiveopensource_0_17_1/build/metastore/test
    [mkdir] Created dir: /usr/local/continuous_builds/src/hiveopensource-0.17.1/hiveopensource_0_17_1/build/metastore/test/src
    [mkdir] Created dir: /usr/local/continuous_builds/src/hiveopensource-0.17.1/hiveopensource_0_17_1/build/metastore/test/classes

model-compile:

core-compile:
     [echo] Compiling: 

model-enhance:

compile:

jar:
     [echo] Jar: metastore

deploy:
     [echo] hive: metastore
Overriding previous definition of reference to test.classpath

init:
    [mkdir] Created dir: /usr/local/continuous_builds/src/hiveopensource-0.17.1/hiveopensource_0_17_1/build/ql/test
    [mkdir] Created dir: /usr/local/continuous_builds/src/hiveopensource-0.17.1/hiveopensource_0_17_1/build/ql/test/src
    [mkdir] Created dir: /usr/local/continuous_builds/src/hiveopensource-0.17.1/hiveopensource_0_17_1/build/ql/test/classes

ql-init:

build-grammar:

compile-ant-tasks:

init:

download-ivy:

init-ivy:

settings-ivy:

resolve:
:: loading settings :: file = /usr/local/continuous_builds/src/hiveopensource-0.17.1/hiveopensource_0_17_1/ivy/ivysettings.xml
[ivy:retrieve] :: resolving dependencies :: org.apache.hadoop.hive#ant;working@devbuild001.snc1.facebook.com
[ivy:retrieve] 	confs: [default]
[ivy:retrieve] :: resolution report :: resolve 9ms :: artifacts dl 0ms
	---------------------------------------------------------------------
	|                  |            modules            ||   artifacts   |
	|       conf       | number| search|dwnlded|evicted|| number|dwnlded|
	---------------------------------------------------------------------
	|      default     |   0   |   0   |   0   |   0   ||   0   |   0   |
	---------------------------------------------------------------------
[ivy:retrieve] :: retrieving :: org.apache.hadoop.hive#ant
[ivy:retrieve] 	confs: [default]
[ivy:retrieve] 	0 artifacts copied, 0 already retrieved (0kB/2ms)

install-hadoopcore:

compile:
     [echo] Compiling: anttasks

deploy-ant-tasks:

init:

download-ivy:

init-ivy:

settings-ivy:

resolve:
:: loading settings :: file = /usr/local/continuous_builds/src/hiveopensource-0.17.1/hiveopensource_0_17_1/ivy/ivysettings.xml
[ivy:retrieve] :: resolving dependencies :: org.apache.hadoop.hive#ant;working@devbuild001.snc1.facebook.com
[ivy:retrieve] 	confs: [default]
[ivy:retrieve] :: resolution report :: resolve 196ms :: artifacts dl 0ms
	---------------------------------------------------------------------
	|                  |            modules            ||   artifacts   |
	|       conf       | number| search|dwnlded|evicted|| number|dwnlded|
	---------------------------------------------------------------------
	|      default     |   0   |   0   |   0   |   0   ||   0   |   0   |
	---------------------------------------------------------------------
[ivy:retrieve] :: retrieving :: org.apache.hadoop.hive#ant
[ivy:retrieve] 	confs: [default]
[ivy:retrieve] 	0 artifacts copied, 0 already retrieved (0kB/2ms)

install-hadoopcore:

compile:
     [echo] Compiling: anttasks

jar:

deploy:
     [echo] hive: anttasks

configure:

compile:
     [echo] Compiling: ql
    [javac] Compiling 8 source files to /usr/local/continuous_builds/src/hiveopensource-0.17.1/hiveopensource_0_17_1/build/ql/classes

jar:
     [echo] Jar: ql
    [unzip] Expanding: /usr/local/continuous_builds/src/hiveopensource-0.17.1/hiveopensource_0_17_1/ql/lib/commons-jexl-1.1.jar
into /usr/local/continuous_builds/src/hiveopensource-0.17.1/hiveopensource_0_17_1/build/jexl/classes
    [unzip] Expanding: /usr/local/continuous_builds/src/hiveopensource-0.17.1/hiveopensource_0_17_1/lib/libthrift.jar
into /usr/local/continuous_builds/src/hiveopensource-0.17.1/hiveopensource_0_17_1/build/thrift/classes
    [unzip] Expanding: /usr/local/continuous_builds/src/hiveopensource-0.17.1/hiveopensource_0_17_1/lib/commons-lang-2.4.jar
into /usr/local/continuous_builds/src/hiveopensource-0.17.1/hiveopensource_0_17_1/build/commons-lang/classes

deploy:
     [echo] hive: ql

init:
    [mkdir] Created dir: /usr/local/continuous_builds/src/hiveopensource-0.17.1/hiveopensource_0_17_1/build/cli/test
    [mkdir] Created dir: /usr/local/continuous_builds/src/hiveopensource-0.17.1/hiveopensource_0_17_1/build/cli/test/src
    [mkdir] Created dir: /usr/local/continuous_builds/src/hiveopensource-0.17.1/hiveopensource_0_17_1/build/cli/test/classes

download-ivy:

init-ivy:

settings-ivy:

resolve:
:: loading settings :: file = /usr/local/continuous_builds/src/hiveopensource-0.17.1/hiveopensource_0_17_1/ivy/ivysettings.xml
[ivy:retrieve] :: resolving dependencies :: org.apache.hadoop.hive#cli;working@devbuild001.snc1.facebook.com
[ivy:retrieve] 	confs: [default]
[ivy:retrieve] 	found hadoop#core;0.17.1 in hadoop-resolver
[ivy:retrieve] :: resolution report :: resolve 52ms :: artifacts dl 6ms
	---------------------------------------------------------------------
	|                  |            modules            ||   artifacts   |
	|       conf       | number| search|dwnlded|evicted|| number|dwnlded|
	---------------------------------------------------------------------
	|      default     |   1   |   0   |   0   |   0   ||   1   |   0   |
	---------------------------------------------------------------------
[ivy:retrieve] :: retrieving :: org.apache.hadoop.hive#cli
[ivy:retrieve] 	confs: [default]
[ivy:retrieve] 	0 artifacts copied, 1 already retrieved (0kB/4ms)

install-hadoopcore:

compile:
     [echo] Compiling: cli

jar:
     [echo] Jar: cli

deploy:
     [echo] hive: cli

init:
    [mkdir] Created dir: /usr/local/continuous_builds/src/hiveopensource-0.17.1/hiveopensource_0_17_1/build/service/test
    [mkdir] Created dir: /usr/local/continuous_builds/src/hiveopensource-0.17.1/hiveopensource_0_17_1/build/service/test/src
    [mkdir] Created dir: /usr/local/continuous_builds/src/hiveopensource-0.17.1/hiveopensource_0_17_1/build/service/test/classes

core-compile:

compile:

jar:
     [echo] Jar: service

deploy:
     [echo] hive: service

init:
    [mkdir] Created dir: /usr/local/continuous_builds/src/hiveopensource-0.17.1/hiveopensource_0_17_1/build/jdbc/test
    [mkdir] Created dir: /usr/local/continuous_builds/src/hiveopensource-0.17.1/hiveopensource_0_17_1/build/jdbc/test/src
    [mkdir] Created dir: /usr/local/continuous_builds/src/hiveopensource-0.17.1/hiveopensource_0_17_1/build/jdbc/test/classes

core-compile:

compile:

jar:
     [echo] Jar: jdbc

deploy:
     [echo] hive: jdbc

test:

test:
     [echo] Nothing to do!

test:
     [echo] Nothing to do!

test-conditions:

gen-test:

init:

core-compile:

compile:

compile-test:
    [javac] Compiling 1 source file to /usr/local/continuous_builds/src/hiveopensource-0.17.1/hiveopensource_0_17_1/build/jdbc/test/classes

test-jar:

test-init:
    [mkdir] Created dir: /usr/local/continuous_builds/src/hiveopensource-0.17.1/hiveopensource_0_17_1/build/jdbc/test/data
     [copy] Copying 18 files to /usr/local/continuous_builds/src/hiveopensource-0.17.1/hiveopensource_0_17_1/build/jdbc/test/data
     [copy] Copied 5 empty directories to 2 empty directories under /usr/local/continuous_builds/src/hiveopensource-0.17.1/hiveopensource_0_17_1/build/jdbc/test/data

test:
    [mkdir] Created dir: /usr/local/continuous_builds/src/hiveopensource-0.17.1/hiveopensource_0_17_1/build/jdbc/test/logs
    [junit] Running org.apache.hadoop.hive.jdbc.TestJdbcDriver
    [junit] Tests run: 1, Failures: 0, Errors: 1, Time elapsed: 18.124 sec
    [junit] FAILED: Parse Error: line 1:15 cannot recognize input 'HiveDriverTable'

    [junit] FAILED: Parse Error: line 1:19 cannot recognize input 'veDriverTable'

    [junit] Test org.apache.hadoop.hive.jdbc.TestJdbcDriver FAILED

BUILD FAILED
/usr/local/continuous_builds/src/hiveopensource-0.17.1/hiveopensource_0_17_1/build.xml:110:
The following error occurred while executing this line:
/usr/local/continuous_builds/src/hiveopensource-0.17.1/hiveopensource_0_17_1/build-common.xml:261:
Tests failed!

Total time: 53 seconds
EXIT VALUE IS 1 for runtests

Mime
View raw message