hadoop-hdfs-issues mailing list archives

Site index · List index
Message view « Date » · « Thread »
Top « Date » · « Thread »
From "Hadoop QA (JIRA)" <j...@apache.org>
Subject [jira] [Commented] (HDDS-1050) TestSCMRestart#testPipelineWithScmRestart is failing
Date Mon, 11 Feb 2019 12:23:00 GMT

    [ https://issues.apache.org/jira/browse/HDDS-1050?page=com.atlassian.jira.plugin.system.issuetabpanels:comment-tabpanel&focusedCommentId=16764908#comment-16764908
] 

Hadoop QA commented on HDDS-1050:
---------------------------------

| (x) *{color:red}-1 overall{color}* |
\\
\\
|| Vote || Subsystem || Runtime || Comment ||
| {color:blue}0{color} | {color:blue} reexec {color} | {color:blue}  0m 17s{color} | {color:blue}
Docker mode activated. {color} |
|| || || || {color:brown} Prechecks {color} ||
| {color:green}+1{color} | {color:green} @author {color} | {color:green}  0m  0s{color} |
{color:green} The patch does not contain any @author tags. {color} |
| {color:green}+1{color} | {color:green} test4tests {color} | {color:green}  0m  0s{color}
| {color:green} The patch appears to include 1 new or modified test files. {color} |
|| || || || {color:brown} trunk Compile Tests {color} ||
| {color:green}+1{color} | {color:green} mvninstall {color} | {color:green}  4m 23s{color}
| {color:green} trunk passed {color} |
| {color:green}+1{color} | {color:green} checkstyle {color} | {color:green}  0m 14s{color}
| {color:green} trunk passed {color} |
| {color:blue}0{color} | {color:blue} findbugs {color} | {color:blue}  0m  0s{color} | {color:blue}
Skipped patched modules with no Java source: . {color} |
| {color:green}+1{color} | {color:green} findbugs {color} | {color:green}  0m  0s{color} |
{color:green} trunk passed {color} |
| {color:green}+1{color} | {color:green} javadoc {color} | {color:green}  1m 41s{color} |
{color:green} trunk passed {color} |
|| || || || {color:brown} Patch Compile Tests {color} ||
| {color:green}+1{color} | {color:green} mvninstall {color} | {color:green}  3m 56s{color}
| {color:green} the patch passed {color} |
| {color:green}+1{color} | {color:green} checkstyle {color} | {color:green}  0m 14s{color}
| {color:green} the patch passed {color} |
| {color:green}+1{color} | {color:green} whitespace {color} | {color:green}  0m  0s{color}
| {color:green} The patch has no whitespace issues. {color} |
| {color:blue}0{color} | {color:blue} findbugs {color} | {color:blue}  0m  0s{color} | {color:blue}
Skipped patched modules with no Java source: . {color} |
| {color:green}+1{color} | {color:green} findbugs {color} | {color:green}  0m  0s{color} |
{color:green} the patch passed {color} |
| {color:green}+1{color} | {color:green} javadoc {color} | {color:green}  1m 38s{color} |
{color:green} the patch passed {color} |
|| || || || {color:brown} Other Tests {color} ||
| {color:red}-1{color} | {color:red} unit {color} | {color:red} 31m  5s{color} | {color:red}
hadoop-ozone in the patch failed. {color} |
| {color:red}-1{color} | {color:red} unit {color} | {color:red}  5m 27s{color} | {color:red}
hadoop-hdds in the patch failed. {color} |
| {color:green}+1{color} | {color:green} asflicense {color} | {color:green}  0m 19s{color}
| {color:green} The patch does not generate ASF License warnings. {color} |
| {color:black}{color} | {color:black} {color} | {color:black} 49m 46s{color} | {color:black}
{color} |
\\
\\
|| Reason || Tests ||
| Failed junit tests | hadoop.ozone.client.rpc.TestSecureOzoneRpcClient |
\\
\\
|| Subsystem || Report/Notes ||
| Docker | Client=17.05.0-ce Server=17.05.0-ce Image:yetus/hadoop:8f97d6f |
| JIRA Issue | HDDS-1050 |
| JIRA Patch URL | https://issues.apache.org/jira/secure/attachment/12958235/HDDS-1050.000.patch
|
| Optional Tests |  asflicense  javac  javadoc  unit  findbugs  checkstyle  |
| uname | Linux 2297f3edb27a 4.4.0-138-generic #164~14.04.1-Ubuntu SMP Fri Oct 5 08:56:16
UTC 2018 x86_64 x86_64 x86_64 GNU/Linux |
| Build tool | maven |
| Personality | /home/jenkins/jenkins-slave/workspace/PreCommit-HDDS-Build/ozone.sh |
| git revision | trunk / e7d1ae5 |
| maven | version: Apache Maven 3.3.9 |
| Default Java | 1.8.0_191 |
| unit | https://builds.apache.org/job/PreCommit-HDDS-Build/2222/artifact/out/patch-unit-hadoop-ozone.txt
|
| unit | https://builds.apache.org/job/PreCommit-HDDS-Build/2222/artifact/out/patch-unit-hadoop-hdds.txt
|
|  Test Results | https://builds.apache.org/job/PreCommit-HDDS-Build/2222/testReport/ |
| Max. process+thread count | 1192 (vs. ulimit of 10000) |
| modules | C: hadoop-ozone/integration-test U: hadoop-ozone/integration-test |
| Console output | https://builds.apache.org/job/PreCommit-HDDS-Build/2222/console |
| Powered by | Apache Yetus 0.8.0-SNAPSHOT   http://yetus.apache.org |


This message was automatically generated.



> TestSCMRestart#testPipelineWithScmRestart is failing
> ----------------------------------------------------
>
>                 Key: HDDS-1050
>                 URL: https://issues.apache.org/jira/browse/HDDS-1050
>             Project: Hadoop Distributed Data Store
>          Issue Type: Test
>          Components: test
>    Affects Versions: 0.3.0
>            Reporter: Nanda kumar
>            Assignee: Supratim Deka
>            Priority: Major
>         Attachments: HDDS-1050.000.patch, HDDS-1050.000.patch
>
>
> {{TestSCMRestart#testPipelineWithScmRestart}} is failing with the below exception
> {code}
> [ERROR] Tests run: 1, Failures: 1, Errors: 0, Skipped: 0, Time elapsed: 11.896 s <<<
FAILURE! - in org.apache.hadoop.hdds.scm.pipeline.TestSCMRestart
> [ERROR] testPipelineWithScmRestart(org.apache.hadoop.hdds.scm.pipeline.TestSCMRestart)
 Time elapsed: 0.047 s  <<< FAILURE!
> java.lang.AssertionError: expected:<PipelineID=8619c522-efdd-41d3-b946-8977ea6c027e>
but was:<PipelineID=c80a63f4-2f55-4d5a-bb1f-3c9e6613318a>
> 	at org.junit.Assert.fail(Assert.java:88)
> 	at org.junit.Assert.failNotEquals(Assert.java:743)
> 	at org.junit.Assert.assertEquals(Assert.java:118)
> 	at org.junit.Assert.assertEquals(Assert.java:144)
> 	at org.apache.hadoop.hdds.scm.pipeline.TestSCMRestart.testPipelineWithScmRestart(TestSCMRestart.java:110)
> 	at sun.reflect.NativeMethodAccessorImpl.invoke0(Native Method)
> 	at sun.reflect.NativeMethodAccessorImpl.invoke(NativeMethodAccessorImpl.java:62)
> 	at sun.reflect.DelegatingMethodAccessorImpl.invoke(DelegatingMethodAccessorImpl.java:43)
> 	at java.lang.reflect.Method.invoke(Method.java:498)
> 	at org.junit.runners.model.FrameworkMethod$1.runReflectiveCall(FrameworkMethod.java:47)
> 	at org.junit.internal.runners.model.ReflectiveCallable.run(ReflectiveCallable.java:12)
> 	at org.junit.runners.model.FrameworkMethod.invokeExplosively(FrameworkMethod.java:44)
> 	at org.junit.internal.runners.statements.InvokeMethod.evaluate(InvokeMethod.java:17)
> 	at org.junit.runners.ParentRunner.runLeaf(ParentRunner.java:271)
> 	at org.junit.runners.BlockJUnit4ClassRunner.runChild(BlockJUnit4ClassRunner.java:70)
> 	at org.junit.runners.BlockJUnit4ClassRunner.runChild(BlockJUnit4ClassRunner.java:50)
> 	at org.junit.runners.ParentRunner$3.run(ParentRunner.java:238)
> 	at org.junit.runners.ParentRunner$1.schedule(ParentRunner.java:63)
> 	at org.junit.runners.ParentRunner.runChildren(ParentRunner.java:236)
> 	at org.junit.runners.ParentRunner.access$000(ParentRunner.java:53)
> 	at org.junit.runners.ParentRunner$2.evaluate(ParentRunner.java:229)
> 	at org.junit.internal.runners.statements.RunBefores.evaluate(RunBefores.java:26)
> 	at org.junit.internal.runners.statements.RunAfters.evaluate(RunAfters.java:27)
> 	at org.junit.runners.ParentRunner.run(ParentRunner.java:309)
> 	at org.apache.maven.surefire.junit4.JUnit4Provider.execute(JUnit4Provider.java:365)
> 	at org.apache.maven.surefire.junit4.JUnit4Provider.executeWithRerun(JUnit4Provider.java:273)
> 	at org.apache.maven.surefire.junit4.JUnit4Provider.executeTestSet(JUnit4Provider.java:238)
> 	at org.apache.maven.surefire.junit4.JUnit4Provider.invoke(JUnit4Provider.java:159)
> 	at org.apache.maven.surefire.booter.ForkedBooter.invokeProviderInSameClassLoader(ForkedBooter.java:384)
> 	at org.apache.maven.surefire.booter.ForkedBooter.runSuitesInProcess(ForkedBooter.java:345)
> 	at org.apache.maven.surefire.booter.ForkedBooter.execute(ForkedBooter.java:126)
> 	at org.apache.maven.surefire.booter.ForkedBooter.main(ForkedBooter.java:418)
> {code}



--
This message was sent by Atlassian JIRA
(v7.6.3#76005)

---------------------------------------------------------------------
To unsubscribe, e-mail: hdfs-issues-unsubscribe@hadoop.apache.org
For additional commands, e-mail: hdfs-issues-help@hadoop.apache.org


Mime
View raw message