hadoop-hdfs-issues mailing list archives

Site index · List index
Message view « Date » · « Thread »
Top « Date » · « Thread »
From "genericqa (JIRA)" <j...@apache.org>
Subject [jira] [Commented] (HDFS-13299) RBF : Fix compilation error in branch-2 (TestMultipleDestinationResolver)
Date Fri, 16 Mar 2018 13:59:00 GMT

    [ https://issues.apache.org/jira/browse/HDFS-13299?page=com.atlassian.jira.plugin.system.issuetabpanels:comment-tabpanel&focusedCommentId=16401939#comment-16401939
] 

genericqa commented on HDFS-13299:
----------------------------------

| (x) *{color:red}-1 overall{color}* |
\\
\\
|| Vote || Subsystem || Runtime || Comment ||
| {color:blue}0{color} | {color:blue} reexec {color} | {color:blue}  0m 20s{color} | {color:blue}
Docker mode activated. {color} |
|| || || || {color:brown} Prechecks {color} ||
| {color:blue}0{color} | {color:blue} findbugs {color} | {color:blue}  0m  0s{color} | {color:blue}
Findbugs executables are not available. {color} |
| {color:green}+1{color} | {color:green} @author {color} | {color:green}  0m  0s{color} |
{color:green} The patch does not contain any @author tags. {color} |
| {color:green}+1{color} | {color:green} test4tests {color} | {color:green}  0m  0s{color}
| {color:green} The patch appears to include 1 new or modified test files. {color} |
|| || || || {color:brown} branch-2 Compile Tests {color} ||
| {color:red}-1{color} | {color:red} mvninstall {color} | {color:red}  6m  5s{color} | {color:red}
root in branch-2 failed. {color} |
| {color:red}-1{color} | {color:red} compile {color} | {color:red}  0m 58s{color} | {color:red}
hadoop-hdfs in branch-2 failed. {color} |
| {color:green}+1{color} | {color:green} checkstyle {color} | {color:green}  0m 31s{color}
| {color:green} branch-2 passed {color} |
| {color:red}-1{color} | {color:red} mvnsite {color} | {color:red}  0m 53s{color} | {color:red}
hadoop-hdfs in branch-2 failed. {color} |
| {color:green}+1{color} | {color:green} javadoc {color} | {color:green}  1m 24s{color} |
{color:green} branch-2 passed {color} |
|| || || || {color:brown} Patch Compile Tests {color} ||
| {color:red}-1{color} | {color:red} mvninstall {color} | {color:red}  0m 50s{color} | {color:red}
hadoop-hdfs in the patch failed. {color} |
| {color:red}-1{color} | {color:red} compile {color} | {color:red}  0m 48s{color} | {color:red}
hadoop-hdfs in the patch failed. {color} |
| {color:red}-1{color} | {color:red} javac {color} | {color:red}  0m 48s{color} | {color:red}
hadoop-hdfs in the patch failed. {color} |
| {color:green}+1{color} | {color:green} checkstyle {color} | {color:green}  0m 27s{color}
| {color:green} the patch passed {color} |
| {color:red}-1{color} | {color:red} mvnsite {color} | {color:red}  0m 50s{color} | {color:red}
hadoop-hdfs in the patch failed. {color} |
| {color:green}+1{color} | {color:green} whitespace {color} | {color:green}  0m  0s{color}
| {color:green} The patch has no whitespace issues. {color} |
| {color:green}+1{color} | {color:green} javadoc {color} | {color:green}  1m 24s{color} |
{color:green} the patch passed {color} |
|| || || || {color:brown} Other Tests {color} ||
| {color:red}-1{color} | {color:red} unit {color} | {color:red}  0m 50s{color} | {color:red}
hadoop-hdfs in the patch failed. {color} |
| {color:green}+1{color} | {color:green} asflicense {color} | {color:green}  0m 25s{color}
| {color:green} The patch does not generate ASF License warnings. {color} |
| {color:black}{color} | {color:black} {color} | {color:black} 17m 25s{color} | {color:black}
{color} |
\\
\\
|| Subsystem || Report/Notes ||
| Docker | Client=17.05.0-ce Server=17.05.0-ce Image:yetus/hadoop:dbd69cb |
| JIRA Issue | HDFS-13299 |
| JIRA Patch URL | https://issues.apache.org/jira/secure/attachment/12914863/HDFS-13299-branch-2.patch
|
| Optional Tests |  asflicense  compile  javac  javadoc  mvninstall  mvnsite  unit  shadedclient
 findbugs  checkstyle  |
| uname | Linux 2d0c84673546 3.13.0-135-generic #184-Ubuntu SMP Wed Oct 18 11:55:51 UTC 2017
x86_64 x86_64 x86_64 GNU/Linux |
| Build tool | maven |
| Personality | /testptch/patchprocess/precommit/personality/provided.sh |
| git revision | branch-2 / b1b1000 |
| maven | version: Apache Maven 3.3.9 (bb52d8502b132ec0a5a3f4c09453c07478323dc5; 2015-11-10T16:41:47+00:00)
|
| Default Java | 1.7.0_151 |
| mvninstall | https://builds.apache.org/job/PreCommit-HDFS-Build/23512/artifact/out/branch-mvninstall-root.txt
|
| compile | https://builds.apache.org/job/PreCommit-HDFS-Build/23512/artifact/out/branch-compile-hadoop-hdfs-project_hadoop-hdfs.txt
|
| mvnsite | https://builds.apache.org/job/PreCommit-HDFS-Build/23512/artifact/out/branch-mvnsite-hadoop-hdfs-project_hadoop-hdfs.txt
|
| mvninstall | https://builds.apache.org/job/PreCommit-HDFS-Build/23512/artifact/out/patch-mvninstall-hadoop-hdfs-project_hadoop-hdfs.txt
|
| compile | https://builds.apache.org/job/PreCommit-HDFS-Build/23512/artifact/out/patch-compile-hadoop-hdfs-project_hadoop-hdfs.txt
|
| javac | https://builds.apache.org/job/PreCommit-HDFS-Build/23512/artifact/out/patch-compile-hadoop-hdfs-project_hadoop-hdfs.txt
|
| mvnsite | https://builds.apache.org/job/PreCommit-HDFS-Build/23512/artifact/out/patch-mvnsite-hadoop-hdfs-project_hadoop-hdfs.txt
|
| unit | https://builds.apache.org/job/PreCommit-HDFS-Build/23512/artifact/out/patch-unit-hadoop-hdfs-project_hadoop-hdfs.txt
|
|  Test Results | https://builds.apache.org/job/PreCommit-HDFS-Build/23512/testReport/ |
| Max. process+thread count | 78 (vs. ulimit of 10000) |
| modules | C: hadoop-hdfs-project/hadoop-hdfs U: hadoop-hdfs-project/hadoop-hdfs |
| Console output | https://builds.apache.org/job/PreCommit-HDFS-Build/23512/console |
| Powered by | Apache Yetus 0.8.0-SNAPSHOT   http://yetus.apache.org |


This message was automatically generated.



> RBF : Fix compilation error in branch-2 (TestMultipleDestinationResolver)
> -------------------------------------------------------------------------
>
>                 Key: HDFS-13299
>                 URL: https://issues.apache.org/jira/browse/HDFS-13299
>             Project: Hadoop HDFS
>          Issue Type: Sub-task
>            Reporter: Brahma Reddy Battula
>            Assignee: Brahma Reddy Battula
>            Priority: Blocker
>         Attachments: HDFS-13299-branch-2.patch
>
>
> {noformat}
> [ERROR] Failed to execute goal org.apache.maven.plugins:maven-compiler-plugin:3.1:testCompile
(default-testCompile) on p
> roject hadoop-hdfs: Compilation failure: Compilation failure:
> [ERROR] /D:/branch-2/hadoop/hadoop-hdfs-project/hadoop-hdfs/src/test/java/org/apache/hadoop/hdfs/server/federation/resol
> ver/order/TestLocalResolver.java:[84,16] local variable sb is accessed from within inner
class; needs to be declared fin
> al
> [ERROR] /D:/branch-2/hadoop/hadoop-hdfs-project/hadoop-hdfs/src/test/java/org/apache/hadoop/hdfs/server/federation/resol
> ver/TestMultipleDestinationResolver.java:[391,27] incompatible types: java.util.TreeSet<java.lang.Object>
cannot be conv
> erted to java.util.Set<java.lang.String>
> {noformat}



--
This message was sent by Atlassian JIRA
(v7.6.3#76005)

---------------------------------------------------------------------
To unsubscribe, e-mail: hdfs-issues-unsubscribe@hadoop.apache.org
For additional commands, e-mail: hdfs-issues-help@hadoop.apache.org


Mime
View raw message