hadoop-hdfs-issues mailing list archives

Site index · List index
Message view « Date » · « Thread »
Top « Date » · « Thread »
From "Hadoop QA (JIRA)" <j...@apache.org>
Subject [jira] [Commented] (HDFS-10572) Fix TestOfflineEditsViewer#testGenerated
Date Sat, 02 Jul 2016 13:58:11 GMT

    [ https://issues.apache.org/jira/browse/HDFS-10572?page=com.atlassian.jira.plugin.system.issuetabpanels:comment-tabpanel&focusedCommentId=15360186#comment-15360186
] 

Hadoop QA commented on HDFS-10572:
----------------------------------

| (x) *{color:red}-1 overall{color}* |
\\
\\
|| Vote || Subsystem || Runtime || Comment ||
| {color:blue}0{color} | {color:blue} reexec {color} | {color:blue}  0m 33s{color} | {color:blue}
Docker mode activated. {color} |
| {color:green}+1{color} | {color:green} @author {color} | {color:green}  0m  0s{color} |
{color:green} The patch does not contain any @author tags. {color} |
| {color:red}-1{color} | {color:red} test4tests {color} | {color:red}  0m  0s{color} | {color:red}
The patch doesn't appear to include any new or modified tests. Please justify why no new tests
are needed for this patch. Also please list what manual steps were performed to verify this
patch. {color} |
| {color:green}+1{color} | {color:green} mvninstall {color} | {color:green}  6m 56s{color}
| {color:green} trunk passed {color} |
| {color:green}+1{color} | {color:green} compile {color} | {color:green}  0m 50s{color} |
{color:green} trunk passed {color} |
| {color:green}+1{color} | {color:green} checkstyle {color} | {color:green}  0m 25s{color}
| {color:green} trunk passed {color} |
| {color:green}+1{color} | {color:green} mvnsite {color} | {color:green}  0m 55s{color} |
{color:green} trunk passed {color} |
| {color:green}+1{color} | {color:green} mvneclipse {color} | {color:green}  0m 12s{color}
| {color:green} trunk passed {color} |
| {color:green}+1{color} | {color:green} findbugs {color} | {color:green}  1m 42s{color} |
{color:green} trunk passed {color} |
| {color:green}+1{color} | {color:green} javadoc {color} | {color:green}  0m 56s{color} |
{color:green} trunk passed {color} |
| {color:green}+1{color} | {color:green} mvninstall {color} | {color:green}  0m 47s{color}
| {color:green} the patch passed {color} |
| {color:green}+1{color} | {color:green} compile {color} | {color:green}  0m 43s{color} |
{color:green} the patch passed {color} |
| {color:green}+1{color} | {color:green} javac {color} | {color:green}  0m 43s{color} | {color:green}
the patch passed {color} |
| {color:green}+1{color} | {color:green} checkstyle {color} | {color:green}  0m 23s{color}
| {color:green} the patch passed {color} |
| {color:green}+1{color} | {color:green} mvnsite {color} | {color:green}  0m 50s{color} |
{color:green} the patch passed {color} |
| {color:green}+1{color} | {color:green} mvneclipse {color} | {color:green}  0m  9s{color}
| {color:green} the patch passed {color} |
| {color:green}+1{color} | {color:green} whitespace {color} | {color:green}  0m  0s{color}
| {color:green} The patch has no whitespace issues. {color} |
| {color:green}+1{color} | {color:green} findbugs {color} | {color:green}  1m 47s{color} |
{color:green} the patch passed {color} |
| {color:green}+1{color} | {color:green} javadoc {color} | {color:green}  0m 53s{color} |
{color:green} the patch passed {color} |
| {color:red}-1{color} | {color:red} unit {color} | {color:red} 69m 23s{color} | {color:red}
hadoop-hdfs in the patch failed. {color} |
| {color:green}+1{color} | {color:green} asflicense {color} | {color:green}  0m 18s{color}
| {color:green} The patch does not generate ASF License warnings. {color} |
| {color:black}{color} | {color:black} {color} | {color:black} 88m 55s{color} | {color:black}
{color} |
\\
\\
|| Reason || Tests ||
| Failed junit tests | hadoop.hdfs.qjournal.client.TestQuorumJournalManager |
|   | hadoop.hdfs.server.namenode.snapshot.TestOpenFilesWithSnapshot |
\\
\\
|| Subsystem || Report/Notes ||
| Docker |  Image:yetus/hadoop:85209cc |
| JIRA Patch URL | https://issues.apache.org/jira/secure/attachment/12815909/HDFS-10572-001.patch
|
| JIRA Issue | HDFS-10572 |
| Optional Tests |  asflicense  compile  javac  javadoc  mvninstall  mvnsite  unit  findbugs
 checkstyle  |
| uname | Linux 72b2cac6e3c6 3.13.0-36-lowlatency #63-Ubuntu SMP PREEMPT Wed Sep 3 21:56:12
UTC 2014 x86_64 x86_64 x86_64 GNU/Linux |
| Build tool | maven |
| Personality | /testptch/hadoop/patchprocess/precommit/personality/provided.sh |
| git revision | trunk / 8b281bc |
| Default Java | 1.8.0_91 |
| findbugs | v3.0.0 |
| unit | https://builds.apache.org/job/PreCommit-HDFS-Build/15967/artifact/patchprocess/patch-unit-hadoop-hdfs-project_hadoop-hdfs.txt
|
|  Test Results | https://builds.apache.org/job/PreCommit-HDFS-Build/15967/testReport/ |
| modules | C: hadoop-hdfs-project/hadoop-hdfs U: hadoop-hdfs-project/hadoop-hdfs |
| Console output | https://builds.apache.org/job/PreCommit-HDFS-Build/15967/console |
| Powered by | Apache Yetus 0.4.0-SNAPSHOT   http://yetus.apache.org |


This message was automatically generated.



> Fix TestOfflineEditsViewer#testGenerated
> ----------------------------------------
>
>                 Key: HDFS-10572
>                 URL: https://issues.apache.org/jira/browse/HDFS-10572
>             Project: Hadoop HDFS
>          Issue Type: Bug
>          Components: test
>            Reporter: Xiaoyu Yao
>            Assignee: Surendra Singh Lilhore
>            Priority: Blocker
>         Attachments: HDFS-10572-001.patch
>
>
> The test has been failing consistently on trunk recently. This ticket is open to fix
this test to avoid false alarm on Jenkins. Figure out which recent commit caused this failure
can be a good start. 
>  
> {code}
> -------------------------------------------------------
>  T E S T S
> -------------------------------------------------------
> Running org.apache.hadoop.hdfs.tools.offlineEditsViewer.TestOfflineEditsViewer
> Tests run: 5, Failures: 1, Errors: 0, Skipped: 0, Time elapsed: 15.646 sec <<<
FAILURE! - in org.apache.hadoop.hdfs.tools.offlineEditsViewer.TestOfflineEditsViewer
> testGenerated(org.apache.hadoop.hdfs.tools.offlineEditsViewer.TestOfflineEditsViewer)
 Time elapsed: 3.623 sec  <<< FAILURE!
> java.lang.AssertionError: Generated edits and reparsed (bin to XML to bin) should be
same
> 	at org.junit.Assert.fail(Assert.java:88)
> 	at org.junit.Assert.assertTrue(Assert.java:41)
> 	at org.apache.hadoop.hdfs.tools.offlineEditsViewer.TestOfflineEditsViewer.testGenerated(TestOfflineEditsViewer.java:125)
> Results :
> Failed tests: 
>   TestOfflineEditsViewer.testGenerated:125 Generated edits and reparsed (bin to XML to
bin) should be same
> Tests run: 5, Failures: 1, Errors: 0, Skipped: 0
> {code}



--
This message was sent by Atlassian JIRA
(v6.3.4#6332)

---------------------------------------------------------------------
To unsubscribe, e-mail: hdfs-issues-unsubscribe@hadoop.apache.org
For additional commands, e-mail: hdfs-issues-help@hadoop.apache.org


Mime
View raw message