hadoop-hdfs-issues mailing list archives

Site index · List index
Message view « Date » · « Thread »
Top « Date » · « Thread »
From "Tony Wu (JIRA)" <j...@apache.org>
Subject [jira] [Commented] (HDFS-9493) Test o.a.h.hdfs.server.namenode.TestMetaSave fails in trunk
Date Tue, 29 Dec 2015 23:31:49 GMT

    [ https://issues.apache.org/jira/browse/HDFS-9493?page=com.atlassian.jira.plugin.system.issuetabpanels:comment-tabpanel&focusedCommentId=15074430#comment-15074430
] 

Tony Wu commented on HDFS-9493:
-------------------------------

The test failures are not related to this patch as this patch only affects TestMetaSave, witch
passes.

> Test o.a.h.hdfs.server.namenode.TestMetaSave fails in trunk
> -----------------------------------------------------------
>
>                 Key: HDFS-9493
>                 URL: https://issues.apache.org/jira/browse/HDFS-9493
>             Project: Hadoop HDFS
>          Issue Type: Bug
>          Components: test
>            Reporter: Mingliang Liu
>            Assignee: Tony Wu
>         Attachments: HDFS-9493.001.patch, HDFS-9493.002.patch, HDFS-9493.003.patch
>
>
> Tested in both Gentoo Linux and Mac.
> {quote}
> -------------------------------------------------------
>  T E S T S
> -------------------------------------------------------
> Running org.apache.hadoop.hdfs.server.namenode.TestMetaSave
> Tests run: 3, Failures: 1, Errors: 0, Skipped: 0, Time elapsed: 34.159 sec <<<
FAILURE! - in org.apache.hadoop.hdfs.server.namenode.TestMetaSave
> testMetasaveAfterDelete(org.apache.hadoop.hdfs.server.namenode.TestMetaSave)  Time elapsed:
15.318 sec  <<< FAILURE!
> java.lang.AssertionError: null
> 	at org.junit.Assert.fail(Assert.java:86)
> 	at org.junit.Assert.assertTrue(Assert.java:41)
> 	at org.junit.Assert.assertTrue(Assert.java:52)
> 	at org.apache.hadoop.hdfs.server.namenode.TestMetaSave.testMetasaveAfterDelete(TestMetaSave.java:154)
> {quote}



--
This message was sent by Atlassian JIRA
(v6.3.4#6332)

Mime
View raw message