hadoop-hdfs-issues mailing list archives

Site index · List index
Message view « Date » · « Thread »
Top « Date » · « Thread »
From "Kihwal Lee (JIRA)" <j...@apache.org>
Subject [jira] [Created] (HDFS-9383) TestByteArrayManager#testByteArrayManager fails
Date Thu, 05 Nov 2015 16:41:27 GMT
Kihwal Lee created HDFS-9383:
--------------------------------

             Summary: TestByteArrayManager#testByteArrayManager fails
                 Key: HDFS-9383
                 URL: https://issues.apache.org/jira/browse/HDFS-9383
             Project: Hadoop HDFS
          Issue Type: Bug
            Reporter: Kihwal Lee


This was seen in the trunk builds
https://builds.apache.org/job/Hadoop-Hdfs-trunk

{noformat}
Running org.apache.hadoop.hdfs.util.TestByteArrayManager
Tests run: 3, Failures: 1, Errors: 0, Skipped: 0, Time elapsed: 6.539 sec <<< FAILURE!
 - in org.apache.hadoop.hdfs.util.TestByteArrayManager
testByteArrayManager(org.apache.hadoop.hdfs.util.TestByteArrayManager)  Time elapsed: 5.409
sec  <<< FAILURE!
java.lang.AssertionError: expected null, but was:<[32: 2/64, free=5]>
	at org.junit.Assert.fail(Assert.java:88)
	at org.junit.Assert.failNotNull(Assert.java:664)
	at org.junit.Assert.assertNull(Assert.java:646)
	at org.junit.Assert.assertNull(Assert.java:656)
	at org.apache.hadoop.hdfs.util.TestByteArrayManager.testByteArrayManager(TestByteArrayManager.java:384)
{noformat}



--
This message was sent by Atlassian JIRA
(v6.3.4#6332)

Mime
View raw message