hadoop-hdfs-issues mailing list archives

Site index · List index
Message view « Date » · « Thread »
Top « Date » · « Thread »
From "Hudson (JIRA)" <j...@apache.org>
Subject [jira] [Commented] (HDFS-9196) Fix TestWebHdfsContentLength
Date Wed, 07 Oct 2015 07:16:26 GMT

    [ https://issues.apache.org/jira/browse/HDFS-9196?page=com.atlassian.jira.plugin.system.issuetabpanels:comment-tabpanel&focusedCommentId=14946411#comment-14946411
] 

Hudson commented on HDFS-9196:
------------------------------

FAILURE: Integrated in Hadoop-trunk-Commit #8584 (See [https://builds.apache.org/job/Hadoop-trunk-Commit/8584/])
HDFS-9196. Fix TestWebHdfsContentLength. Contributed by Masatake (jing9: rev 239d119c6707e58c9a5e0099c6d65fe956e95140)
* hadoop-hdfs-project/hadoop-hdfs/CHANGES.txt
* hadoop-hdfs-project/hadoop-hdfs-client/src/main/java/org/apache/hadoop/hdfs/web/WebHdfsFileSystem.java


> Fix TestWebHdfsContentLength
> ----------------------------
>
>                 Key: HDFS-9196
>                 URL: https://issues.apache.org/jira/browse/HDFS-9196
>             Project: Hadoop HDFS
>          Issue Type: Bug
>            Reporter: Tsuyoshi Ozawa
>            Assignee: Masatake Iwasaki
>             Fix For: 2.8.0
>
>         Attachments: HDFS-9196.001.patch
>
>
> {quote}
> Tests run: 7, Failures: 2, Errors: 0, Skipped: 0, Time elapsed: 181.278 sec <<<
FAILURE! - in org.apache.hadoop.hdfs.web.TestWebHdfsContentLength
> testPutOp(org.apache.hadoop.hdfs.web.TestWebHdfsContentLength)  Time elapsed: 60.05 sec
 <<< FAILURE!
> java.lang.AssertionError: expected:<0> but was:<null>
> 	at org.junit.Assert.fail(Assert.java:88)
> 	at org.junit.Assert.failNotEquals(Assert.java:743)
> 	at org.junit.Assert.assertEquals(Assert.java:118)
> 	at org.junit.Assert.assertEquals(Assert.java:144)
> 	at org.apache.hadoop.hdfs.web.TestWebHdfsContentLength.testPutOp(TestWebHdfsContentLength.java:116)
> testPutOpWithRedirect(org.apache.hadoop.hdfs.web.TestWebHdfsContentLength)  Time elapsed:
0.01 sec  <<< FAILURE!
> org.junit.ComparisonFailure: expected:<[chunked]> but was:<[0]>
> 	at org.junit.Assert.assertEquals(Assert.java:115)
> 	at org.junit.Assert.assertEquals(Assert.java:144)
> 	at org.apache.hadoop.hdfs.web.TestWebHdfsContentLength.testPutOpWithRedirect(TestWebHdfsContentLength.java:130)
> {quote}



--
This message was sent by Atlassian JIRA
(v6.3.4#6332)

Mime
View raw message