hadoop-hdfs-issues mailing list archives

Site index · List index
Message view « Date » · « Thread »
Top « Date » · « Thread »
From "Ted Yu (JIRA)" <j...@apache.org>
Subject [jira] [Resolved] (HDFS-6177) TestHttpFSServer fails occasionally in trunk
Date Sun, 15 Feb 2015 15:23:14 GMT

     [ https://issues.apache.org/jira/browse/HDFS-6177?page=com.atlassian.jira.plugin.system.issuetabpanels:all-tabpanel
]

Ted Yu resolved HDFS-6177.
--------------------------
    Resolution: Cannot Reproduce

> TestHttpFSServer fails occasionally in trunk
> --------------------------------------------
>
>                 Key: HDFS-6177
>                 URL: https://issues.apache.org/jira/browse/HDFS-6177
>             Project: Hadoop HDFS
>          Issue Type: Test
>            Reporter: Ted Yu
>            Priority: Minor
>
> From https://builds.apache.org/job/Hadoop-hdfs-trunk/1716/consoleFull :
> {code}
> Running org.apache.hadoop.fs.http.server.TestHttpFSServer
> Tests run: 7, Failures: 1, Errors: 0, Skipped: 0, Time elapsed: 8.424 sec <<<
FAILURE! - in org.apache.hadoop.fs.http.server.TestHttpFSServer
> testDelegationTokenOperations(org.apache.hadoop.fs.http.server.TestHttpFSServer)  Time
elapsed: 0.559 sec  <<< FAILURE!
> java.lang.AssertionError: expected:<401> but was:<403>
> 	at org.junit.Assert.fail(Assert.java:93)
> 	at org.junit.Assert.failNotEquals(Assert.java:647)
> 	at org.junit.Assert.assertEquals(Assert.java:128)
> 	at org.junit.Assert.assertEquals(Assert.java:472)
> 	at org.junit.Assert.assertEquals(Assert.java:456)
> 	at org.apache.hadoop.fs.http.server.TestHttpFSServer.testDelegationTokenOperations(TestHttpFSServer.java:352)
> {code}



--
This message was sent by Atlassian JIRA
(v6.3.4#6332)

Mime
View raw message