hadoop-hdfs-issues mailing list archives

Site index · List index
Message view « Date » · « Thread »
Top « Date » · « Thread »
From "Chris Nauroth (JIRA)" <j...@apache.org>
Subject [jira] [Updated] (HDFS-7288) HDFS compiling failure on trunk
Date Fri, 24 Oct 2014 18:59:35 GMT

     [ https://issues.apache.org/jira/browse/HDFS-7288?page=com.atlassian.jira.plugin.system.issuetabpanels:all-tabpanel
]

Chris Nauroth updated HDFS-7288:
--------------------------------
            Priority: Blocker  (was: Major)
    Target Version/s: 2.6.0

> HDFS compiling failure on trunk
> -------------------------------
>
>                 Key: HDFS-7288
>                 URL: https://issues.apache.org/jira/browse/HDFS-7288
>             Project: Hadoop HDFS
>          Issue Type: Bug
>            Reporter: Zhijie Shen
>            Priority: Blocker
>
> See https://builds.apache.org/job/PreCommit-YARN-Build/5545/artifact/patchprocess/trunkJavacWarnings.txt
> {code}
> [INFO] 40 errors 
> [INFO] -------------------------------------------------------------
> [INFO] ------------------------------------------------------------------------
> [INFO] Reactor Summary:
> [INFO] 
> [INFO] Apache Hadoop Main ................................ SUCCESS [  0.285 s]
> [INFO] Apache Hadoop Project POM ......................... SUCCESS [  0.462 s]
> [INFO] Apache Hadoop Annotations ......................... SUCCESS [  1.368 s]
> [INFO] Apache Hadoop Project Dist POM .................... SUCCESS [  0.116 s]
> [INFO] Apache Hadoop Assemblies .......................... SUCCESS [  0.108 s]
> [INFO] Apache Hadoop Maven Plugins ....................... SUCCESS [  2.382 s]
> [INFO] Apache Hadoop MiniKDC ............................. SUCCESS [  2.612 s]
> [INFO] Apache Hadoop Auth ................................ SUCCESS [  3.365 s]
> [INFO] Apache Hadoop Auth Examples ....................... SUCCESS [  1.018 s]
> [INFO] Apache Hadoop Common .............................. SUCCESS [ 20.312 s]
> [INFO] Apache Hadoop NFS ................................. SUCCESS [  3.382 s]
> [INFO] Apache Hadoop KMS ................................. SUCCESS [  4.705 s]
> [INFO] Apache Hadoop Common Project ...................... SUCCESS [  0.029 s]
> [INFO] Apache Hadoop HDFS ................................ FAILURE [ 25.008 s]
> [INFO] Apache Hadoop HttpFS .............................. SKIPPED
> [INFO] Apache Hadoop HDFS BookKeeper Journal ............. SKIPPED
> [INFO] Apache Hadoop HDFS-NFS ............................ SKIPPED
> [INFO] Apache Hadoop HDFS Project ........................ SKIPPED
> [INFO] hadoop-yarn ....................................... SKIPPED
> [INFO] hadoop-yarn-api ................................... SKIPPED
> [INFO] hadoop-yarn-common ................................ SKIPPED
> [INFO] hadoop-yarn-server ................................ SKIPPED
> [INFO] hadoop-yarn-server-common ......................... SKIPPED
> [INFO] hadoop-yarn-server-nodemanager .................... SKIPPED
> [INFO] hadoop-yarn-server-web-proxy ...................... SKIPPED
> [INFO] hadoop-yarn-server-applicationhistoryservice ...... SKIPPED
> [INFO] hadoop-yarn-server-resourcemanager ................ SKIPPED
> [INFO] hadoop-yarn-server-tests .......................... SKIPPED
> [INFO] hadoop-yarn-client ................................ SKIPPED
> [INFO] hadoop-yarn-server-sharedcachemanager ............. SKIPPED
> [INFO] hadoop-yarn-applications .......................... SKIPPED
> [INFO] hadoop-yarn-applications-distributedshell ......... SKIPPED
> [INFO] hadoop-yarn-applications-unmanaged-am-launcher .... SKIPPED
> [INFO] hadoop-yarn-site .................................. SKIPPED
> [INFO] hadoop-yarn-registry .............................. SKIPPED
> [INFO] hadoop-yarn-project ............................... SKIPPED
> [INFO] hadoop-mapreduce-client ........................... SKIPPED
> [INFO] hadoop-mapreduce-client-core ...................... SKIPPED
> [INFO] hadoop-mapreduce-client-common .................... SKIPPED
> [INFO] hadoop-mapreduce-client-shuffle ................... SKIPPED
> [INFO] hadoop-mapreduce-client-app ....................... SKIPPED
> [INFO] hadoop-mapreduce-client-hs ........................ SKIPPED
> [INFO] hadoop-mapreduce-client-jobclient ................. SKIPPED
> [INFO] hadoop-mapreduce-client-hs-plugins ................ SKIPPED
> [INFO] hadoop-mapreduce-client-nativetask ................ SKIPPED
> [INFO] Apache Hadoop MapReduce Examples .................. SKIPPED
> [INFO] hadoop-mapreduce .................................. SKIPPED
> [INFO] Apache Hadoop MapReduce Streaming ................. SKIPPED
> [INFO] Apache Hadoop Distributed Copy .................... SKIPPED
> [INFO] Apache Hadoop Archives ............................ SKIPPED
> [INFO] Apache Hadoop Rumen ............................... SKIPPED
> [INFO] Apache Hadoop Gridmix ............................. SKIPPED
> [INFO] Apache Hadoop Data Join ........................... SKIPPED
> [INFO] Apache Hadoop Ant Tasks ........................... SKIPPED
> [INFO] Apache Hadoop Extras .............................. SKIPPED
> [INFO] Apache Hadoop Pipes ............................... SKIPPED
> [INFO] Apache Hadoop OpenStack support ................... SKIPPED
> [INFO] Apache Hadoop Amazon Web Services support ......... SKIPPED
> [INFO] Apache Hadoop Azure support ....................... SKIPPED
> [INFO] Apache Hadoop Client .............................. SKIPPED
> [INFO] Apache Hadoop Mini-Cluster ........................ SKIPPED
> [INFO] Apache Hadoop Scheduler Load Simulator ............ SKIPPED
> [INFO] Apache Hadoop Tools Dist .......................... SKIPPED
> [INFO] Apache Hadoop Tools ............................... SKIPPED
> [INFO] Apache Hadoop Distribution ........................ SKIPPED
> [INFO] ------------------------------------------------------------------------
> [INFO] BUILD FAILURE
> [INFO] ------------------------------------------------------------------------
> [INFO] Total time: 01:08 min
> [INFO] Finished at: 2014-10-24T18:42:14+00:00
> [INFO] Final Memory: 47M/813M
> [INFO] ------------------------------------------------------------------------
> [ERROR] Failed to execute goal org.apache.maven.plugins:maven-compiler-plugin:2.5.1:compile
(default-compile) on project hadoop-hdfs: Compilation failure: Compilation failure:
> [ERROR] /home/jenkins/jenkins-slave/workspace/PreCommit-YARN-Build/hadoop-hdfs-project/hadoop-hdfs/src/main/java/org/apache/hadoop/hdfs/shortcircuit/ShortCircuitShm.java:[39,15]
sun.misc.Unsafe is Sun proprietary API and may be removed in a future release
> [ERROR] /home/jenkins/jenkins-slave/workspace/PreCommit-YARN-Build/hadoop-hdfs-project/hadoop-hdfs/src/main/java/org/apache/hadoop/hdfs/shortcircuit/ShortCircuitShm.java:[53,23]
sun.misc.Unsafe is Sun proprietary API and may be removed in a future release
> [ERROR] /home/jenkins/jenkins-slave/workspace/PreCommit-YARN-Build/hadoop-hdfs-project/hadoop-hdfs/src/main/java/org/apache/hadoop/hdfs/shortcircuit/ShortCircuitShm.java:[55,17]
sun.misc.Unsafe is Sun proprietary API and may be removed in a future release
> [ERROR] /home/jenkins/jenkins-slave/workspace/PreCommit-YARN-Build/hadoop-hdfs-project/hadoop-hdfs/src/main/java/org/apache/hadoop/hdfs/server/namenode/web/resources/NamenodeWebHdfsMethods.java:[726,16]
cannot find symbol
> [ERROR] symbol  : class TokenKindParam
> [ERROR] location: class org.apache.hadoop.hdfs.server.namenode.web.resources.NamenodeWebHdfsMethods
> [ERROR] /home/jenkins/jenkins-slave/workspace/PreCommit-YARN-Build/hadoop-hdfs-project/hadoop-hdfs/src/main/java/org/apache/hadoop/hdfs/server/namenode/web/resources/NamenodeWebHdfsMethods.java:[728,16]
cannot find symbol
> [ERROR] symbol  : class TokenServiceParam
> [ERROR] location: class org.apache.hadoop.hdfs.server.namenode.web.resources.NamenodeWebHdfsMethods
> [ERROR] /home/jenkins/jenkins-slave/workspace/PreCommit-YARN-Build/hadoop-hdfs-project/hadoop-hdfs/src/main/java/org/apache/hadoop/hdfs/server/namenode/web/resources/NamenodeWebHdfsMethods.java:[767,16]
cannot find symbol
> [ERROR] symbol  : class TokenKindParam
> [ERROR] location: class org.apache.hadoop.hdfs.server.namenode.web.resources.NamenodeWebHdfsMethods
> [ERROR] /home/jenkins/jenkins-slave/workspace/PreCommit-YARN-Build/hadoop-hdfs-project/hadoop-hdfs/src/main/java/org/apache/hadoop/hdfs/server/namenode/web/resources/NamenodeWebHdfsMethods.java:[769,16]
cannot find symbol
> [ERROR] symbol  : class TokenServiceParam
> [ERROR] location: class org.apache.hadoop.hdfs.server.namenode.web.resources.NamenodeWebHdfsMethods
> [ERROR] /home/jenkins/jenkins-slave/workspace/PreCommit-YARN-Build/hadoop-hdfs-project/hadoop-hdfs/src/main/java/org/apache/hadoop/hdfs/server/namenode/web/resources/NamenodeWebHdfsMethods.java:[806,12]
cannot find symbol
> [ERROR] symbol  : class TokenKindParam
> [ERROR] location: class org.apache.hadoop.hdfs.server.namenode.web.resources.NamenodeWebHdfsMethods
> [ERROR] /home/jenkins/jenkins-slave/workspace/PreCommit-YARN-Build/hadoop-hdfs-project/hadoop-hdfs/src/main/java/org/apache/hadoop/hdfs/server/namenode/web/resources/NamenodeWebHdfsMethods.java:[807,12]
cannot find symbol
> [ERROR] symbol  : class TokenServiceParam
> [ERROR] location: class org.apache.hadoop.hdfs.server.namenode.web.resources.NamenodeWebHdfsMethods
> [ERROR] /home/jenkins/jenkins-slave/workspace/PreCommit-YARN-Build/hadoop-hdfs-project/hadoop-hdfs/src/main/java/org/apache/hadoop/hdfs/DeprecatedUTF8.java:[38,56]
[deprecation] org.apache.hadoop.io.UTF8 in org.apache.hadoop.io has been deprecated
> [ERROR] /home/jenkins/jenkins-slave/workspace/PreCommit-YARN-Build/hadoop-hdfs-project/hadoop-hdfs/src/main/java/org/apache/hadoop/hdfs/tools/offlineEditsViewer/XmlEditsVisitor.java:[32,31]
[deprecation] org.apache.xml.serialize.OutputFormat in org.apache.xml.serialize has been deprecated
> [ERROR] /home/jenkins/jenkins-slave/workspace/PreCommit-YARN-Build/hadoop-hdfs-project/hadoop-hdfs/src/main/java/org/apache/hadoop/hdfs/tools/offlineEditsViewer/XmlEditsVisitor.java:[33,31]
[deprecation] org.apache.xml.serialize.XMLSerializer in org.apache.xml.serialize has been
deprecated
> [ERROR] /home/jenkins/jenkins-slave/workspace/PreCommit-YARN-Build/hadoop-hdfs-project/hadoop-hdfs/src/main/java/org/apache/hadoop/hdfs/server/namenode/web/resources/NamenodeWebHdfsMethods.java:[725,18]
cannot find symbol
> [ERROR] symbol  : variable TokenKindParam
> [ERROR] location: class org.apache.hadoop.hdfs.server.namenode.web.resources.NamenodeWebHdfsMethods
> [ERROR] /home/jenkins/jenkins-slave/workspace/PreCommit-YARN-Build/hadoop-hdfs-project/hadoop-hdfs/src/main/java/org/apache/hadoop/hdfs/server/namenode/web/resources/NamenodeWebHdfsMethods.java:[725,53]
cannot find symbol
> [ERROR] symbol  : variable TokenKindParam
> [ERROR] location: class org.apache.hadoop.hdfs.server.namenode.web.resources.NamenodeWebHdfsMethods
> [ERROR] /home/jenkins/jenkins-slave/workspace/PreCommit-YARN-Build/hadoop-hdfs-project/hadoop-hdfs/src/main/java/org/apache/hadoop/hdfs/server/namenode/web/resources/NamenodeWebHdfsMethods.java:[727,18]
cannot find symbol
> [ERROR] symbol  : variable TokenServiceParam
> [ERROR] location: class org.apache.hadoop.hdfs.server.namenode.web.resources.NamenodeWebHdfsMethods
> [ERROR] /home/jenkins/jenkins-slave/workspace/PreCommit-YARN-Build/hadoop-hdfs-project/hadoop-hdfs/src/main/java/org/apache/hadoop/hdfs/server/namenode/web/resources/NamenodeWebHdfsMethods.java:[727,56]
cannot find symbol
> [ERROR] symbol  : variable TokenServiceParam
> [ERROR] location: class org.apache.hadoop.hdfs.server.namenode.web.resources.NamenodeWebHdfsMethods
> [ERROR] /home/jenkins/jenkins-slave/workspace/PreCommit-YARN-Build/hadoop-hdfs-project/hadoop-hdfs/src/main/java/org/apache/hadoop/hdfs/server/namenode/web/resources/NamenodeWebHdfsMethods.java:[766,18]
cannot find symbol
> [ERROR] symbol  : variable TokenKindParam
> [ERROR] location: class org.apache.hadoop.hdfs.server.namenode.web.resources.NamenodeWebHdfsMethods
> [ERROR] /home/jenkins/jenkins-slave/workspace/PreCommit-YARN-Build/hadoop-hdfs-project/hadoop-hdfs/src/main/java/org/apache/hadoop/hdfs/server/namenode/web/resources/NamenodeWebHdfsMethods.java:[766,53]
cannot find symbol
> [ERROR] symbol  : variable TokenKindParam
> [ERROR] location: class org.apache.hadoop.hdfs.server.namenode.web.resources.NamenodeWebHdfsMethods
> [ERROR] /home/jenkins/jenkins-slave/workspace/PreCommit-YARN-Build/hadoop-hdfs-project/hadoop-hdfs/src/main/java/org/apache/hadoop/hdfs/server/namenode/web/resources/NamenodeWebHdfsMethods.java:[768,18]
cannot find symbol
> [ERROR] symbol  : variable TokenServiceParam
> [ERROR] location: class org.apache.hadoop.hdfs.server.namenode.web.resources.NamenodeWebHdfsMethods
> [ERROR] /home/jenkins/jenkins-slave/workspace/PreCommit-YARN-Build/hadoop-hdfs-project/hadoop-hdfs/src/main/java/org/apache/hadoop/hdfs/server/namenode/web/resources/NamenodeWebHdfsMethods.java:[768,56]
cannot find symbol
> [ERROR] symbol  : variable TokenServiceParam
> [ERROR] location: class org.apache.hadoop.hdfs.server.namenode.web.resources.NamenodeWebHdfsMethods
> [ERROR] /home/jenkins/jenkins-slave/workspace/PreCommit-YARN-Build/hadoop-hdfs-project/hadoop-hdfs/src/main/java/org/apache/hadoop/hdfs/server/namenode/FSImage.java:[970,17]
[deprecation] org.apache.hadoop.hdfs.server.namenode.FSImageFormat.Saver in org.apache.hadoop.hdfs.server.namenode.FSImageFormat
has been deprecated
> [ERROR] /home/jenkins/jenkins-slave/workspace/PreCommit-YARN-Build/hadoop-hdfs-project/hadoop-hdfs/src/main/java/org/apache/hadoop/hdfs/server/namenode/FSImage.java:[970,49]
[deprecation] org.apache.hadoop.hdfs.server.namenode.FSImageFormat.Saver in org.apache.hadoop.hdfs.server.namenode.FSImageFormat
has been deprecated
> [ERROR] /home/jenkins/jenkins-slave/workspace/PreCommit-YARN-Build/hadoop-hdfs-project/hadoop-hdfs/src/main/java/org/apache/hadoop/hdfs/shortcircuit/ShortCircuitShm.java:[57,16]
sun.misc.Unsafe is Sun proprietary API and may be removed in a future release
> [ERROR] /home/jenkins/jenkins-slave/workspace/PreCommit-YARN-Build/hadoop-hdfs-project/hadoop-hdfs/src/main/java/org/apache/hadoop/hdfs/shortcircuit/ShortCircuitShm.java:[59,14]
sun.misc.Unsafe is Sun proprietary API and may be removed in a future release
> [ERROR] /home/jenkins/jenkins-slave/workspace/PreCommit-YARN-Build/hadoop-hdfs-project/hadoop-hdfs/src/main/java/org/apache/hadoop/hdfs/protocolPB/PBHelper.java:[1857,8]
[deprecation] setStorageUuid(java.lang.String) in org.apache.hadoop.hdfs.protocol.proto.HdfsProtos.StorageReportProto.Builder
has been deprecated
> [ERROR] /home/jenkins/jenkins-slave/workspace/PreCommit-YARN-Build/hadoop-hdfs-project/hadoop-hdfs/src/main/java/org/apache/hadoop/hdfs/protocolPB/PBHelper.java:[1866,33]
[deprecation] getStorageUuid() in org.apache.hadoop.hdfs.protocol.proto.HdfsProtos.StorageReportProto
has been deprecated
> [ERROR] /home/jenkins/jenkins-slave/workspace/PreCommit-YARN-Build/hadoop-hdfs-project/hadoop-hdfs/src/main/java/org/apache/hadoop/hdfs/protocolPB/DatanodeProtocolClientSideTranslatorPB.java:[216,16]
[deprecation] setStorageUuid(java.lang.String) in org.apache.hadoop.hdfs.protocol.proto.DatanodeProtocolProtos.StorageReceivedDeletedBlocksProto.Builder
has been deprecated
> [ERROR] /home/jenkins/jenkins-slave/workspace/PreCommit-YARN-Build/hadoop-hdfs-project/hadoop-hdfs/src/main/java/org/apache/hadoop/hdfs/server/datanode/BlockSender.java:[419,35]
[deprecation] getReplica(java.lang.String,long) in org.apache.hadoop.hdfs.server.datanode.fsdataset.FsDatasetSpi
has been deprecated
> [ERROR] /home/jenkins/jenkins-slave/workspace/PreCommit-YARN-Build/hadoop-hdfs-project/hadoop-hdfs/src/main/java/org/apache/hadoop/hdfs/web/WebHdfsFileSystem.java:[1114,14]
[deprecation] getDefaultBlockSize() in org.apache.hadoop.fs.FileSystem has been deprecated
> [ERROR] /home/jenkins/jenkins-slave/workspace/PreCommit-YARN-Build/hadoop-hdfs-project/hadoop-hdfs/src/main/java/org/apache/hadoop/hdfs/web/WebHdfsFileSystem.java:[1120,15]
[deprecation] getDefaultReplication() in org.apache.hadoop.fs.FileSystem has been deprecated
> [ERROR] /home/jenkins/jenkins-slave/workspace/PreCommit-YARN-Build/hadoop-hdfs-project/hadoop-hdfs/src/main/java/org/apache/hadoop/hdfs/DistributedFileSystem.java:[159,14]
[deprecation] getDefaultBlockSize() in org.apache.hadoop.fs.FileSystem has been deprecated
> [ERROR] /home/jenkins/jenkins-slave/workspace/PreCommit-YARN-Build/hadoop-hdfs-project/hadoop-hdfs/src/main/java/org/apache/hadoop/hdfs/DistributedFileSystem.java:[164,15]
[deprecation] getDefaultReplication() in org.apache.hadoop.fs.FileSystem has been deprecated
> [ERROR] /home/jenkins/jenkins-slave/workspace/PreCommit-YARN-Build/hadoop-hdfs-project/hadoop-hdfs/src/main/java/org/apache/hadoop/hdfs/DistributedFileSystem.java:[412,33]
[deprecation] primitiveCreate(org.apache.hadoop.fs.Path,org.apache.hadoop.fs.permission.FsPermission,java.util.EnumSet<org.apache.hadoop.fs.CreateFlag>,int,short,long,org.apache.hadoop.util.Progressable,org.apache.hadoop.fs.Options.ChecksumOpt)
in org.apache.hadoop.fs.FileSystem has been deprecated
> [ERROR] /home/jenkins/jenkins-slave/workspace/PreCommit-YARN-Build/hadoop-hdfs-project/hadoop-hdfs/src/main/java/org/apache/hadoop/hdfs/DistributedFileSystem.java:[1068,26]
[deprecation] getServerDefaults() in org.apache.hadoop.fs.FileSystem has been deprecated
> [ERROR] /home/jenkins/jenkins-slave/workspace/PreCommit-YARN-Build/hadoop-hdfs-project/hadoop-hdfs/src/main/java/org/apache/hadoop/hdfs/protocolPB/DatanodeProtocolServerSideTranslatorPB.java:[205,57]
[deprecation] getStorageUuid() in org.apache.hadoop.hdfs.protocol.proto.DatanodeProtocolProtos.StorageReceivedDeletedBlocksProto
has been deprecated
> [ERROR] /home/jenkins/jenkins-slave/workspace/PreCommit-YARN-Build/hadoop-hdfs-project/hadoop-hdfs/src/main/java/org/apache/hadoop/hdfs/protocolPB/DatanodeProtocolServerSideTranslatorPB.java:[205,18]
[deprecation] StorageReceivedDeletedBlocks(java.lang.String,org.apache.hadoop.hdfs.server.protocol.ReceivedDeletedBlockInfo[])
in org.apache.hadoop.hdfs.server.protocol.StorageReceivedDeletedBlocks has been deprecated
> [ERROR] /home/jenkins/jenkins-slave/workspace/PreCommit-YARN-Build/hadoop-hdfs-project/hadoop-hdfs/src/main/java/org/apache/hadoop/hdfs/tools/offlineEditsViewer/XmlEditsVisitor.java:[55,4]
[deprecation] org.apache.xml.serialize.OutputFormat in org.apache.xml.serialize has been deprecated
> [ERROR] /home/jenkins/jenkins-slave/workspace/PreCommit-YARN-Build/hadoop-hdfs-project/hadoop-hdfs/src/main/java/org/apache/hadoop/hdfs/tools/offlineEditsViewer/XmlEditsVisitor.java:[55,33]
[deprecation] org.apache.xml.serialize.OutputFormat in org.apache.xml.serialize has been deprecated
> [ERROR] /home/jenkins/jenkins-slave/workspace/PreCommit-YARN-Build/hadoop-hdfs-project/hadoop-hdfs/src/main/java/org/apache/hadoop/hdfs/tools/offlineEditsViewer/XmlEditsVisitor.java:[59,4]
[deprecation] org.apache.xml.serialize.XMLSerializer in org.apache.xml.serialize has been
deprecated
> [ERROR] /home/jenkins/jenkins-slave/workspace/PreCommit-YARN-Build/hadoop-hdfs-project/hadoop-hdfs/src/main/java/org/apache/hadoop/hdfs/tools/offlineEditsViewer/XmlEditsVisitor.java:[59,35]
[deprecation] org.apache.xml.serialize.XMLSerializer in org.apache.xml.serialize has been
deprecated
> [ERROR] -> [Help 1]
> [ERROR] 
> [ERROR] To see the full stack trace of the errors, re-run Maven with the -e switch.
> [ERROR] Re-run Maven using the -X switch to enable full debug logging.
> [ERROR] 
> [ERROR] For more information about the errors and possible solutions, please read the
following articles:
> [ERROR] [Help 1] http://cwiki.apache.org/confluence/display/MAVEN/MojoFailureException
> [ERROR] 
> [ERROR] After correcting the problems, you can resume the build with the command
> [ERROR]   mvn <goals> -rf :hadoop-hdfs
> {code}



--
This message was sent by Atlassian JIRA
(v6.3.4#6332)

Mime
View raw message