hadoop-hdfs-issues mailing list archives

Site index · List index
Message view « Date » · « Thread »
Top « Date » · « Thread »
From "Ted Yu (JIRA)" <j...@apache.org>
Subject [jira] [Created] (HDFS-7103) TestStorageMover sometimes fails in trunk
Date Fri, 19 Sep 2014 20:28:33 GMT
Ted Yu created HDFS-7103:
----------------------------

             Summary: TestStorageMover sometimes fails in trunk
                 Key: HDFS-7103
                 URL: https://issues.apache.org/jira/browse/HDFS-7103
             Project: Hadoop HDFS
          Issue Type: Test
            Reporter: Ted Yu
            Priority: Minor


>From https://builds.apache.org/job/Hadoop-Hdfs-trunk/1876/console :
{code}
Running org.apache.hadoop.hdfs.server.mover.TestStorageMover
Tests run: 5, Failures: 2, Errors: 0, Skipped: 0, Time elapsed: 125.179 sec <<< FAILURE!
- in org.apache.hadoop.hdfs.server.mover.TestStorageMover
testNoSpaceArchive(org.apache.hadoop.hdfs.server.mover.TestStorageMover)  Time elapsed: 11.695
sec  <<< FAILURE!
java.lang.AssertionError: null
	at org.junit.Assert.fail(Assert.java:86)
	at org.junit.Assert.assertTrue(Assert.java:41)
	at org.junit.Assert.assertTrue(Assert.java:52)
	at org.apache.hadoop.hdfs.server.mover.TestStorageMover.testNoSpaceArchive(TestStorageMover.java:720)

testNoSpaceDisk(org.apache.hadoop.hdfs.server.mover.TestStorageMover)  Time elapsed: 11.596
sec  <<< FAILURE!
java.lang.AssertionError: null
	at org.junit.Assert.fail(Assert.java:86)
	at org.junit.Assert.assertTrue(Assert.java:41)
	at org.junit.Assert.assertTrue(Assert.java:52)
	at org.apache.hadoop.hdfs.server.mover.TestStorageMover.testNoSpaceDisk(TestStorageMover.java:637)
{code}



--
This message was sent by Atlassian JIRA
(v6.3.4#6332)

Mime
View raw message