hadoop-hdfs-issues mailing list archives

Site index · List index
Message view « Date » · « Thread »
Top « Date » · « Thread »
From "Hadoop QA (JIRA)" <j...@apache.org>
Subject [jira] [Commented] (HDFS-5838) TestcacheDirectives#testCreateAndModifyPools fails
Date Mon, 27 Jan 2014 21:29:39 GMT

    [ https://issues.apache.org/jira/browse/HDFS-5838?page=com.atlassian.jira.plugin.system.issuetabpanels:comment-tabpanel&focusedCommentId=13883341#comment-13883341

Hadoop QA commented on HDFS-5838:

{color:red}-1 overall{color}.  Here are the results of testing the latest attachment 
  against trunk revision .

    {color:green}+1 @author{color}.  The patch does not contain any @author tags.

    {color:green}+1 tests included{color}.  The patch appears to include 1 new or modified
test files.

    {color:green}+1 javac{color}.  The applied patch does not increase the total number of
javac compiler warnings.

    {color:green}+1 javadoc{color}.  The javadoc tool did not generate any warning messages.

    {color:red}-1 eclipse:eclipse{color}.  The patch failed to build with eclipse:eclipse.

    {color:green}+1 findbugs{color}.  The patch does not introduce any new Findbugs (version
1.3.9) warnings.

        {color:red}-1 release audit{color}.  The applied patch generated 1 release audit warnings.

    {color:green}+1 core tests{color}.  The patch passed unit tests in hadoop-hdfs-project/hadoop-hdfs.

    {color:green}+1 contrib tests{color}.  The patch passed contrib unit tests.

Test results: https://builds.apache.org/job/PreCommit-HDFS-Build/5951//testReport/
Release audit warnings: https://builds.apache.org/job/PreCommit-HDFS-Build/5951//artifact/trunk/patchprocess/patchReleaseAuditProblems.txt
Console output: https://builds.apache.org/job/PreCommit-HDFS-Build/5951//console

This message is automatically generated.

> TestcacheDirectives#testCreateAndModifyPools fails
> --------------------------------------------------
>                 Key: HDFS-5838
>                 URL: https://issues.apache.org/jira/browse/HDFS-5838
>             Project: Hadoop HDFS
>          Issue Type: Bug
>    Affects Versions: 3.0.0
>            Reporter: Mit Desai
>            Assignee: Mit Desai
>              Labels: java7
>         Attachments: HDFS-5838.patch
> testCreateAndModifyPools generates an assertion fail when it runs after testBasicPoolOperations.
> {noformat}
> Running org.apache.hadoop.hdfs.server.namenode.TestCacheDirectives
> Tests run: 1, Failures: 1, Errors: 0, Skipped: 0, Time elapsed: 5.045 sec <<<
FAILURE! - in org.apache.hadoop.hdfs.server.namenode.TestCacheDirectives
> test(org.apache.hadoop.hdfs.server.namenode.TestCacheDirectives)  Time elapsed: 4.649
sec  <<< FAILURE!
> java.lang.AssertionError: expected no cache pools after deleting pool
> 	at org.junit.Assert.fail(Assert.java:93)
> 	at org.junit.Assert.assertTrue(Assert.java:43)
> 	at org.junit.Assert.assertFalse(Assert.java:68)
> 	at org.apache.hadoop.hdfs.server.namenode.TestCacheDirectives.testCreateAndModifyPools(TestCacheDirectives.java:334)
> 	at org.apache.hadoop.hdfs.server.namenode.TestCacheDirectives.test(TestCacheDirectives.java:160)
> Results :
> Failed tests: 
>   TestCacheDirectives.test:160->testCreateAndModifyPools:334 expected no cache pools
after deleting pool
> {noformat}

This message was sent by Atlassian JIRA

View raw message