hadoop-hdfs-issues mailing list archives

Site index · List index
Message view « Date » · « Thread »
Top « Date » · « Thread »
From "Mit Desai (JIRA)" <j...@apache.org>
Subject [jira] [Commented] (HDFS-5838) TestcacheDirectives#testCreateAndModifyPools fails
Date Mon, 27 Jan 2014 19:11:39 GMT

    [ https://issues.apache.org/jira/browse/HDFS-5838?page=com.atlassian.jira.plugin.system.issuetabpanels:comment-tabpanel&focusedCommentId=13883130#comment-13883130
] 

Mit Desai commented on HDFS-5838:
---------------------------------

I think the failure will be intermittent. If these tests would run in opposite order the assertion
error may not pop up. Adding a label "java7" so that it can be tracked as a JDK7 issue

> TestcacheDirectives#testCreateAndModifyPools fails
> --------------------------------------------------
>
>                 Key: HDFS-5838
>                 URL: https://issues.apache.org/jira/browse/HDFS-5838
>             Project: Hadoop HDFS
>          Issue Type: Bug
>    Affects Versions: 3.0.0
>            Reporter: Mit Desai
>            Assignee: Mit Desai
>              Labels: java7
>         Attachments: HDFS-5838.patch
>
>
> testCreateAndModifyPools generates an assertion fail when it runs after testBasicPoolOperations.
> {noformat}
> Running org.apache.hadoop.hdfs.server.namenode.TestCacheDirectives
> Tests run: 1, Failures: 1, Errors: 0, Skipped: 0, Time elapsed: 5.045 sec <<<
FAILURE! - in org.apache.hadoop.hdfs.server.namenode.TestCacheDirectives
> test(org.apache.hadoop.hdfs.server.namenode.TestCacheDirectives)  Time elapsed: 4.649
sec  <<< FAILURE!
> java.lang.AssertionError: expected no cache pools after deleting pool
> 	at org.junit.Assert.fail(Assert.java:93)
> 	at org.junit.Assert.assertTrue(Assert.java:43)
> 	at org.junit.Assert.assertFalse(Assert.java:68)
> 	at org.apache.hadoop.hdfs.server.namenode.TestCacheDirectives.testCreateAndModifyPools(TestCacheDirectives.java:334)
> 	at org.apache.hadoop.hdfs.server.namenode.TestCacheDirectives.test(TestCacheDirectives.java:160)
> Results :
> Failed tests: 
>   TestCacheDirectives.test:160->testCreateAndModifyPools:334 expected no cache pools
after deleting pool
> {noformat}



--
This message was sent by Atlassian JIRA
(v6.1.5#6160)

Mime
View raw message