hadoop-hdfs-issues mailing list archives

Site index · List index
Message view « Date » · « Thread »
Top « Date » · « Thread »
From "Kihwal Lee (JIRA)" <j...@apache.org>
Subject [jira] [Commented] (HDFS-4687) TestDelegationTokenForProxyUser#testWebHdfsDoAs is flaky with JDK7
Date Tue, 16 Jul 2013 23:50:50 GMT

    [ https://issues.apache.org/jira/browse/HDFS-4687?page=com.atlassian.jira.plugin.system.issuetabpanels:comment-tabpanel&focusedCommentId=13710496#comment-13710496
] 

Kihwal Lee commented on HDFS-4687:
----------------------------------

I see the same failure in branch-2. I will pull this into branch-2.
                
> TestDelegationTokenForProxyUser#testWebHdfsDoAs is flaky with JDK7
> ------------------------------------------------------------------
>
>                 Key: HDFS-4687
>                 URL: https://issues.apache.org/jira/browse/HDFS-4687
>             Project: Hadoop HDFS
>          Issue Type: Bug
>          Components: test
>    Affects Versions: 3.0.0
>            Reporter: Andrew Wang
>            Assignee: Andrew Wang
>            Priority: Minor
>             Fix For: 3.0.0
>
>         Attachments: hdfs-4687-1.patch
>
>
> Fails fairly often with JDK7.
> {noformat}
> Running org.apache.hadoop.hdfs.security.TestDelegationTokenForProxyUser
> Tests run: 2, Failures: 1, Errors: 0, Skipped: 0, Time elapsed: 5.623 sec <<<
FAILURE!
> testWebHdfsDoAs(org.apache.hadoop.hdfs.security.TestDelegationTokenForProxyUser)  Time
elapsed: 4765 sec  <<< FAILURE!
> java.lang.AssertionError: expected:<200> but was:<401>
> 	at org.junit.Assert.fail(Assert.java:91)
> 	at org.junit.Assert.failNotEquals(Assert.java:645)
> 	at org.junit.Assert.assertEquals(Assert.java:126)
> 	at org.junit.Assert.assertEquals(Assert.java:470)
> 	at org.junit.Assert.assertEquals(Assert.java:454)
> 	at org.apache.hadoop.hdfs.web.WebHdfsTestUtil.connectAndGetJson(WebHdfsTestUtil.java:78)
> 	at org.apache.hadoop.hdfs.security.TestDelegationTokenForProxyUser.testWebHdfsDoAs(TestDelegationTokenForProxyUser.java:174)
> 	at sun.reflect.NativeMethodAccessorImpl.invoke0(Native Method)
> 	at sun.reflect.NativeMethodAccessorImpl.invoke(NativeMethodAccessorImpl.java:57)
> 	at sun.reflect.DelegatingMethodAccessorImpl.invoke(DelegatingMethodAccessorImpl.java:43)
> 	at java.lang.reflect.Method.invoke(Method.java:601)
> 	at org.junit.runners.model.FrameworkMethod$1.runReflectiveCall(FrameworkMethod.java:44)
> 	at org.junit.internal.runners.model.ReflectiveCallable.run(ReflectiveCallable.java:15)
> 	at org.junit.runners.model.FrameworkMethod.invokeExplosively(FrameworkMethod.java:41)
> 	at org.junit.internal.runners.statements.InvokeMethod.evaluate(InvokeMethod.java:20)
> 	at org.junit.internal.runners.statements.RunBefores.evaluate(RunBefores.java:28)
> 	at org.junit.internal.runners.statements.RunAfters.evaluate(RunAfters.java:31)
> 	at org.junit.runners.BlockJUnit4ClassRunner.runNotIgnored(BlockJUnit4ClassRunner.java:79)
> 	at org.junit.runners.BlockJUnit4ClassRunner.runChild(BlockJUnit4ClassRunner.java:71)
> 	at org.junit.runners.BlockJUnit4ClassRunner.runChild(BlockJUnit4ClassRunner.java:49)
> 	at org.junit.runners.ParentRunner$3.run(ParentRunner.java:193)
> 	at org.junit.runners.ParentRunner$1.schedule(ParentRunner.java:52)
> 	at org.junit.runners.ParentRunner.runChildren(ParentRunner.java:191)
> 	at org.junit.runners.ParentRunner.access$000(ParentRunner.java:42)
> 	at org.junit.runners.ParentRunner$2.evaluate(ParentRunner.java:184)
> 	at org.junit.runners.ParentRunner.run(ParentRunner.java:236)
> 	at org.apache.maven.surefire.junit4.JUnit4Provider.execute(JUnit4Provider.java:252)
> 	at org.apache.maven.surefire.junit4.JUnit4Provider.executeTestSet(JUnit4Provider.java:141)
> 	at org.apache.maven.surefire.junit4.JUnit4Provider.invoke(JUnit4Provider.java:112)
> 	at sun.reflect.NativeMethodAccessorImpl.invoke0(Native Method)
> 	at sun.reflect.NativeMethodAccessorImpl.invoke(NativeMethodAccessorImpl.java:57)
> 	at sun.reflect.DelegatingMethodAccessorImpl.invoke(DelegatingMethodAccessorImpl.java:43)
> 	at java.lang.reflect.Method.invoke(Method.java:601)
> 	at org.apache.maven.surefire.util.ReflectionUtils.invokeMethodWithArray(ReflectionUtils.java:189)
> 	at org.apache.maven.surefire.booter.ProviderFactory$ProviderProxy.invoke(ProviderFactory.java:165)
> 	at org.apache.maven.surefire.booter.ProviderFactory.invokeProvider(ProviderFactory.java:85)
> 	at org.apache.maven.surefire.booter.ForkedBooter.runSuitesInProcess(ForkedBooter.java:115)
> 	at org.apache.maven.surefire.booter.ForkedBooter.main(ForkedBooter.java:75)
> {noformat}

--
This message is automatically generated by JIRA.
If you think it was sent incorrectly, please contact your JIRA administrators
For more information on JIRA, see: http://www.atlassian.com/software/jira

Mime
View raw message