hadoop-hdfs-issues mailing list archives

Site index · List index
Message view « Date » · « Thread »
Top « Date » · « Thread »
From "Aaron T. Myers (JIRA)" <j...@apache.org>
Subject [jira] [Commented] (HDFS-2299) TestOfflineEditsViewer is failing on trunk
Date Mon, 29 Aug 2011 18:46:37 GMT

    [ https://issues.apache.org/jira/browse/HDFS-2299?page=com.atlassian.jira.plugin.system.issuetabpanels:comment-tabpanel&focusedCommentId=13093073#comment-13093073
] 

Aaron T. Myers commented on HDFS-2299:
--------------------------------------

The full stack trace:

{noformat}
-------------------------------------------------------------------------------
Test set: org.apache.hadoop.hdfs.tools.offlineEditsViewer.TestOfflineEditsViewer
-------------------------------------------------------------------------------
Tests run: 2, Failures: 1, Errors: 0, Skipped: 0, Time elapsed: 5.652 sec <<< FAILURE!
testStored(org.apache.hadoop.hdfs.tools.offlineEditsViewer.TestOfflineEditsViewer)  Time elapsed:
0.038 sec  <<< FAILURE!
java.lang.AssertionError: Reference XML edits and parsed to XML should be same
  at org.junit.Assert.fail(Assert.java:91)
  at org.junit.Assert.assertTrue(Assert.java:43)
  at org.apache.hadoop.hdfs.tools.offlineEditsViewer.TestOfflineEditsViewer.testStored(TestOfflineEditsViewer.java:140)
  at sun.reflect.NativeMethodAccessorImpl.invoke0(Native Method)
  at sun.reflect.NativeMethodAccessorImpl.invoke(NativeMethodAccessorImpl.java:39)
  at sun.reflect.DelegatingMethodAccessorImpl.invoke(DelegatingMethodAccessorImpl.java:25)
  at java.lang.reflect.Method.invoke(Method.java:597)
  at org.junit.runners.model.FrameworkMethod$1.runReflectiveCall(FrameworkMethod.java:44)
  at org.junit.internal.runners.model.ReflectiveCallable.run(ReflectiveCallable.java:15)
  at org.junit.runners.model.FrameworkMethod.invokeExplosively(FrameworkMethod.java:41)
  at org.junit.internal.runners.statements.InvokeMethod.evaluate(InvokeMethod.java:20)
  at org.junit.internal.runners.statements.RunBefores.evaluate(RunBefores.java:28)
  at org.junit.runners.BlockJUnit4ClassRunner.runChild(BlockJUnit4ClassRunner.java:76)
  at org.junit.runners.BlockJUnit4ClassRunner.runChild(BlockJUnit4ClassRunner.java:50)
  at org.junit.runners.ParentRunner$3.run(ParentRunner.java:193)
  at org.junit.runners.ParentRunner$1.schedule(ParentRunner.java:52)
  at org.junit.runners.ParentRunner.runChildren(ParentRunner.java:191)
  at org.junit.runners.ParentRunner.access$000(ParentRunner.java:42)
  at org.junit.runners.ParentRunner$2.evaluate(ParentRunner.java:184)
  at org.junit.runners.ParentRunner.run(ParentRunner.java:236)
  at org.apache.maven.surefire.junit4.JUnit4TestSet.execute(JUnit4TestSet.java:59)
  at org.apache.maven.surefire.suite.AbstractDirectoryTestSuite.executeTestSet(AbstractDirectoryTestSuite.java:120)
  at org.apache.maven.surefire.suite.AbstractDirectoryTestSuite.execute(AbstractDirectoryTestSuite.java:145)
  at org.apache.maven.surefire.Surefire.run(Surefire.java:104)
  at sun.reflect.NativeMethodAccessorImpl.invoke0(Native Method)
  at sun.reflect.NativeMethodAccessorImpl.invoke(NativeMethodAccessorImpl.java:39)
  at sun.reflect.DelegatingMethodAccessorImpl.invoke(DelegatingMethodAccessorImpl.java:25)
  at java.lang.reflect.Method.invoke(Method.java:597)
  at org.apache.maven.surefire.booter.SurefireBooter.runSuitesInProcess(SurefireBooter.java:290)
  at org.apache.maven.surefire.booter.SurefireBooter.main(SurefireBooter.java:1017)
{noformat}

> TestOfflineEditsViewer is failing on trunk
> ------------------------------------------
>
>                 Key: HDFS-2299
>                 URL: https://issues.apache.org/jira/browse/HDFS-2299
>             Project: Hadoop HDFS
>          Issue Type: Bug
>          Components: test
>    Affects Versions: 0.24.0
>            Reporter: Aaron T. Myers
>
> The relevant bit of the error:
> {noformat}
> -------------------------------------------------------------------------------
> Test set: org.apache.hadoop.hdfs.tools.offlineEditsViewer.TestOfflineEditsViewer
> -------------------------------------------------------------------------------
> Tests run: 2, Failures: 1, Errors: 0, Skipped: 0, Time elapsed: 5.652 sec <<<
FAILURE!
> testStored(org.apache.hadoop.hdfs.tools.offlineEditsViewer.TestOfflineEditsViewer)  Time
elapsed: 0.038 sec  <<< FAILURE!
> java.lang.AssertionError: Reference XML edits and parsed to XML should be same
> {noformat}

--
This message is automatically generated by JIRA.
For more information on JIRA, see: http://www.atlassian.com/software/jira

        

Mime
View raw message