hadoop-hdfs-dev mailing list archives

Site index · List index
Message view « Date » · « Thread »
Top « Date » · « Thread »
From Apache Jenkins Server <jenk...@builds.apache.org>
Subject Apache Hadoop qbt Report: trunk+JDK8 on Linux/aarch
Date Wed, 08 Jan 2020 01:12:10 GMT
ARM Build Details : https://builds.apache.org/job/Hadoop-qbt-linux-ARM-trunk/72/

============================ 
CHANGES 
============================ 

[Jan 6, 2020 4:16:11 PM] (snemeth) YARN-10026. Pull out common code pieces from ATS v1.5 and
v2.
[Jan 6, 2020 6:24:16 PM] (eyang) YARN-9956. Improved connection error message for YARN ApiServerClient.
 
[Jan 6, 2020 7:10:39 PM] (stevel) HDFS-14788. Use dynamic regex filter to ignore copy of source
files in
[Jan 7, 2020 2:10:32 AM] (tasanuma) HDFS-15066. HttpFS: Implement setErasureCodingPolicy ,
[Jan 7, 2020 11:17:37 AM] (stevel) HADOOP-16645. S3A Delegation Token extension point to use
StoreContext.
[Jan 7, 2020 11:49:24 AM] (aajisaka) HADOOP-16773. Fix duplicate assertj-core dependency in
hadoop-common


============================ 
TESTS 
============================ 

There are 23482 total tests of which 12 test(s) failed and 2456 test(s) were skipped.  

============================ 
FAILED TESTS 
============================ 

12 tests failed.
FAILED:  org.apache.hadoop.yarn.applications.distributedshell.TestDistributedShell.testDSShellWithDomainV1_5
FAILED:  org.apache.hadoop.yarn.applications.distributedshell.TestDistributedShell.testDSShellWithOpportunisticContainers
FAILED:  org.apache.hadoop.yarn.applications.distributedshell.TestDistributedShell.testDSShellWithEnforceExecutionType
FAILED:  org.apache.hadoop.yarn.server.timelineservice.reader.TestTimelineReaderWebServicesHBaseStorage.org.apache.hadoop.yarn.server.timelineservice.reader.TestTimelineReaderWebServicesHBaseStorage
FAILED:  org.apache.hadoop.yarn.server.timelineservice.storage.TestHBaseTimelineStorageApps.org.apache.hadoop.yarn.server.timelineservice.storage.TestHBaseTimelineStorageApps
FAILED:  org.apache.hadoop.yarn.server.timelineservice.storage.TestHBaseTimelineStorageDomain.org.apache.hadoop.yarn.server.timelineservice.storage.TestHBaseTimelineStorageDomain
FAILED:  org.apache.hadoop.yarn.server.timelineservice.storage.TestHBaseTimelineStorageEntities.org.apache.hadoop.yarn.server.timelineservice.storage.TestHBaseTimelineStorageEntities
FAILED:  org.apache.hadoop.yarn.server.timelineservice.storage.TestHBaseTimelineStorageSchema.org.apache.hadoop.yarn.server.timelineservice.storage.TestHBaseTimelineStorageSchema
FAILED:  org.apache.hadoop.yarn.server.timelineservice.storage.TestTimelineWriterHBaseDown.testTimelineWriterHBaseDown
FAILED:  org.apache.hadoop.yarn.server.timelineservice.storage.flow.TestHBaseStorageFlowActivity.org.apache.hadoop.yarn.server.timelineservice.storage.flow.TestHBaseStorageFlowActivity
FAILED:  org.apache.hadoop.yarn.server.timelineservice.storage.flow.TestHBaseStorageFlowRun.org.apache.hadoop.yarn.server.timelineservice.storage.flow.TestHBaseStorageFlowRun
FAILED:  org.apache.hadoop.yarn.server.timelineservice.storage.flow.TestHBaseStorageFlowRunCompaction.org.apache.hadoop.yarn.server.timelineservice.storage.flow.TestHBaseStorageFlowRunCompaction


Complete test report can be accessed at https://builds.apache.org/job/Hadoop-qbt-linux-ARM-trunk/72/testReport

IN ATTACHMENT COMPRESSED BUILD LOGS.
Mime
View raw message