hadoop-hdfs-dev mailing list archives

Site index · List index
Message view « Date » · « Thread »
Top « Date » · « Thread »
From Apache Jenkins Server <jenk...@builds.apache.org>
Subject Apache Hadoop qbt Report: trunk+JDK8 on Linux/aarch
Date Sat, 04 Jan 2020 01:10:48 GMT
ARM Build Details : https://builds.apache.org/job/Hadoop-qbt-linux-ARM-trunk/68/

============================ 
CHANGES 
============================ 

[Jan 2, 2020 4:12:36 PM] (ayushsaxena) HADOOP-16784. Update the year to 2020. Contributed
by Ayush Saxena.
[Jan 2, 2020 5:03:07 PM] (stevel) HADOOP-16751. DurationInfo text parsing/formatting should
be moved out


============================ 
TESTS 
============================ 

There are 23463 total tests of which 11 test(s) failed and 2456 test(s) were skipped.  

============================ 
FAILED TESTS 
============================ 

11 tests failed.
FAILED:  org.apache.hadoop.yarn.applications.distributedshell.TestDistributedShell.testDSShellWithOpportunisticContainers
FAILED:  org.apache.hadoop.yarn.applications.distributedshell.TestDistributedShell.testDSShellWithEnforceExecutionType
FAILED:  org.apache.hadoop.yarn.server.timelineservice.reader.TestTimelineReaderWebServicesHBaseStorage.org.apache.hadoop.yarn.server.timelineservice.reader.TestTimelineReaderWebServicesHBaseStorage
FAILED:  org.apache.hadoop.yarn.server.timelineservice.storage.TestHBaseTimelineStorageApps.org.apache.hadoop.yarn.server.timelineservice.storage.TestHBaseTimelineStorageApps
FAILED:  org.apache.hadoop.yarn.server.timelineservice.storage.TestHBaseTimelineStorageDomain.org.apache.hadoop.yarn.server.timelineservice.storage.TestHBaseTimelineStorageDomain
FAILED:  org.apache.hadoop.yarn.server.timelineservice.storage.TestHBaseTimelineStorageEntities.org.apache.hadoop.yarn.server.timelineservice.storage.TestHBaseTimelineStorageEntities
FAILED:  org.apache.hadoop.yarn.server.timelineservice.storage.TestHBaseTimelineStorageSchema.org.apache.hadoop.yarn.server.timelineservice.storage.TestHBaseTimelineStorageSchema
FAILED:  org.apache.hadoop.yarn.server.timelineservice.storage.TestTimelineWriterHBaseDown.testTimelineWriterHBaseDown
FAILED:  org.apache.hadoop.yarn.server.timelineservice.storage.flow.TestHBaseStorageFlowActivity.org.apache.hadoop.yarn.server.timelineservice.storage.flow.TestHBaseStorageFlowActivity
FAILED:  org.apache.hadoop.yarn.server.timelineservice.storage.flow.TestHBaseStorageFlowRun.org.apache.hadoop.yarn.server.timelineservice.storage.flow.TestHBaseStorageFlowRun
FAILED:  org.apache.hadoop.yarn.server.timelineservice.storage.flow.TestHBaseStorageFlowRunCompaction.org.apache.hadoop.yarn.server.timelineservice.storage.flow.TestHBaseStorageFlowRunCompaction


Complete test report can be accessed at https://builds.apache.org/job/Hadoop-qbt-linux-ARM-trunk/68/testReport

IN ATTACHMENT COMPRESSED BUILD LOGS.
Mime
View raw message