hadoop-hdfs-dev mailing list archives

Site index · List index
Message view « Date » · « Thread »
Top « Date » · « Thread »
From Apache Jenkins Server <jenk...@builds.apache.org>
Subject Apache Hadoop qbt Report: trunk+JDK8 on Linux/aarch
Date Thu, 16 Jan 2020 01:21:32 GMT
ARM Build Details : https://builds.apache.org/job/Hadoop-qbt-linux-ARM-trunk/80/

============================ 
CHANGES 
============================ 

[Jan 15, 2020 1:28:37 AM] (dazhou) HADOOP-16005. NativeAzureFileSystem does not support setXAttr.
[Jan 15, 2020 3:09:09 AM] (aajisaka) MAPREDUCE-7256. Fix javadoc error in SimpleExponentialSmoothing.
(#1804)
[Jan 15, 2020 8:55:41 AM] (snemeth) YARN-9970. Refactor
[Jan 15, 2020 10:50:25 AM] (aajisaka) HADOOP-16803. Upgrade jackson-databind to 2.9.10.2.
(#1805)
[Jan 15, 2020 11:42:13 AM] (snemeth) YARN-10082. FS-CS converter: disable terminal placement
rule checking.


============================ 
TESTS 
============================ 

There are 23530 total tests of which 11 test(s) failed and 2468 test(s) were skipped.  

============================ 
FAILED TESTS 
============================ 

11 tests failed.
FAILED:  org.apache.hadoop.yarn.applications.distributedshell.TestDistributedShell.testDSShellWithOpportunisticContainers
FAILED:  org.apache.hadoop.yarn.applications.distributedshell.TestDistributedShell.testDSShellWithEnforceExecutionType
FAILED:  org.apache.hadoop.yarn.server.timelineservice.reader.TestTimelineReaderWebServicesHBaseStorage.org.apache.hadoop.yarn.server.timelineservice.reader.TestTimelineReaderWebServicesHBaseStorage
FAILED:  org.apache.hadoop.yarn.server.timelineservice.storage.TestHBaseTimelineStorageApps.org.apache.hadoop.yarn.server.timelineservice.storage.TestHBaseTimelineStorageApps
FAILED:  org.apache.hadoop.yarn.server.timelineservice.storage.TestHBaseTimelineStorageDomain.org.apache.hadoop.yarn.server.timelineservice.storage.TestHBaseTimelineStorageDomain
FAILED:  org.apache.hadoop.yarn.server.timelineservice.storage.TestHBaseTimelineStorageEntities.org.apache.hadoop.yarn.server.timelineservice.storage.TestHBaseTimelineStorageEntities
FAILED:  org.apache.hadoop.yarn.server.timelineservice.storage.TestHBaseTimelineStorageSchema.org.apache.hadoop.yarn.server.timelineservice.storage.TestHBaseTimelineStorageSchema
FAILED:  org.apache.hadoop.yarn.server.timelineservice.storage.TestTimelineWriterHBaseDown.testTimelineWriterHBaseDown
FAILED:  org.apache.hadoop.yarn.server.timelineservice.storage.flow.TestHBaseStorageFlowActivity.org.apache.hadoop.yarn.server.timelineservice.storage.flow.TestHBaseStorageFlowActivity
FAILED:  org.apache.hadoop.yarn.server.timelineservice.storage.flow.TestHBaseStorageFlowRun.org.apache.hadoop.yarn.server.timelineservice.storage.flow.TestHBaseStorageFlowRun
FAILED:  org.apache.hadoop.yarn.server.timelineservice.storage.flow.TestHBaseStorageFlowRunCompaction.org.apache.hadoop.yarn.server.timelineservice.storage.flow.TestHBaseStorageFlowRunCompaction


Complete test report can be accessed at https://builds.apache.org/job/Hadoop-qbt-linux-ARM-trunk/80/testReport

IN ATTACHMENT COMPRESSED BUILD LOGS.
Mime
View raw message