hadoop-hdfs-dev mailing list archives

Site index · List index
Message view « Date » · « Thread »
Top « Date » · « Thread »
From Apache Jenkins Server <jenk...@builds.apache.org>
Subject Apache Hadoop qbt Report: trunk+JDK8 on Linux/aarch
Date Tue, 07 Jan 2020 01:11:52 GMT
ARM Build Details : https://builds.apache.org/job/Hadoop-qbt-linux-ARM-trunk/71/

============================ 
CHANGES 
============================ 

[Jan 6, 2020 3:31:13 AM] (aajisaka) HDFS-15089. RBF: SmallFix for RBFMetrics in doc (#1786)
[Jan 6, 2020 3:36:11 AM] (aajisaka) MAPREDUCE-7255. Fix typo in MapReduce documentaion example
(#1793)
[Jan 6, 2020 9:09:59 AM] (tasanuma) HDFS-15090. RBF: MountPoint Listing Should Return Flag
Values Of
[Jan 6, 2020 3:26:33 PM] (snemeth) YARN-10035. Add ability to filter the Cluster Applications
API request


============================ 
TESTS 
============================ 

There are 23465 total tests of which 11 test(s) failed and 2456 test(s) were skipped.  

============================ 
FAILED TESTS 
============================ 

11 tests failed.
FAILED:  org.apache.hadoop.yarn.applications.distributedshell.TestDistributedShell.testDSShellWithOpportunisticContainers
FAILED:  org.apache.hadoop.yarn.applications.distributedshell.TestDistributedShell.testDSShellWithEnforceExecutionType
FAILED:  org.apache.hadoop.yarn.server.timelineservice.reader.TestTimelineReaderWebServicesHBaseStorage.org.apache.hadoop.yarn.server.timelineservice.reader.TestTimelineReaderWebServicesHBaseStorage
FAILED:  org.apache.hadoop.yarn.server.timelineservice.storage.TestHBaseTimelineStorageApps.org.apache.hadoop.yarn.server.timelineservice.storage.TestHBaseTimelineStorageApps
FAILED:  org.apache.hadoop.yarn.server.timelineservice.storage.TestHBaseTimelineStorageDomain.org.apache.hadoop.yarn.server.timelineservice.storage.TestHBaseTimelineStorageDomain
FAILED:  org.apache.hadoop.yarn.server.timelineservice.storage.TestHBaseTimelineStorageEntities.org.apache.hadoop.yarn.server.timelineservice.storage.TestHBaseTimelineStorageEntities
FAILED:  org.apache.hadoop.yarn.server.timelineservice.storage.TestHBaseTimelineStorageSchema.org.apache.hadoop.yarn.server.timelineservice.storage.TestHBaseTimelineStorageSchema
FAILED:  org.apache.hadoop.yarn.server.timelineservice.storage.TestTimelineWriterHBaseDown.testTimelineWriterHBaseDown
FAILED:  org.apache.hadoop.yarn.server.timelineservice.storage.flow.TestHBaseStorageFlowActivity.org.apache.hadoop.yarn.server.timelineservice.storage.flow.TestHBaseStorageFlowActivity
FAILED:  org.apache.hadoop.yarn.server.timelineservice.storage.flow.TestHBaseStorageFlowRun.org.apache.hadoop.yarn.server.timelineservice.storage.flow.TestHBaseStorageFlowRun
FAILED:  org.apache.hadoop.yarn.server.timelineservice.storage.flow.TestHBaseStorageFlowRunCompaction.org.apache.hadoop.yarn.server.timelineservice.storage.flow.TestHBaseStorageFlowRunCompaction


Complete test report can be accessed at https://builds.apache.org/job/Hadoop-qbt-linux-ARM-trunk/71/testReport

IN ATTACHMENT COMPRESSED BUILD LOGS.
Mime
View raw message