hadoop-hdfs-dev mailing list archives

Site index · List index
Message view « Date » · « Thread »
Top « Date » · « Thread »
From Apache Jenkins Server <jenk...@builds.apache.org>
Subject Apache Hadoop qbt Report: trunk+JDK8 on Linux/aarch
Date Fri, 03 Jan 2020 01:11:06 GMT
ARM Build Details : https://builds.apache.org/job/Hadoop-qbt-linux-ARM-trunk/67/

============================ 
CHANGES 
============================ 

[Jan 2, 2020 6:14:00 AM] (rakeshr) HDFS-14740. Recover data blocks from persistent memory
read cache during
[Jan 2, 2020 8:37:49 AM] (pjoseph) YARN-10053. Use Shared Group Mapping Service in Placement
Rules.
[Jan 2, 2020 8:42:43 AM] (pjoseph) Revert "YARN-10053. Use Shared Group Mapping Service in
Placement
[Jan 2, 2020 8:43:57 AM] (pjoseph) YARN-10053. Use Shared Group Mapping Service in Placement
Rules.
[Jan 2, 2020 3:36:33 PM] (stevel) HADOOP-16775. DistCp reuses the same temp file within the
task for
[Jan 2, 2020 3:49:42 PM] (stevel) HADOOP-16777. Add Tez to LimitedPrivate of


============================ 
TESTS 
============================ 

There are 23463 total tests of which 12 test(s) failed and 2456 test(s) were skipped.  

============================ 
FAILED TESTS 
============================ 

12 tests failed.
FAILED:  org.apache.hadoop.hdfs.server.federation.security.TestRouterSecurityManager.testCreateCredentials
FAILED:  org.apache.hadoop.yarn.applications.distributedshell.TestDistributedShell.testDSShellWithOpportunisticContainers
FAILED:  org.apache.hadoop.yarn.applications.distributedshell.TestDistributedShell.testDSShellWithEnforceExecutionType
FAILED:  org.apache.hadoop.yarn.server.timelineservice.reader.TestTimelineReaderWebServicesHBaseStorage.org.apache.hadoop.yarn.server.timelineservice.reader.TestTimelineReaderWebServicesHBaseStorage
FAILED:  org.apache.hadoop.yarn.server.timelineservice.storage.TestHBaseTimelineStorageApps.org.apache.hadoop.yarn.server.timelineservice.storage.TestHBaseTimelineStorageApps
FAILED:  org.apache.hadoop.yarn.server.timelineservice.storage.TestHBaseTimelineStorageDomain.org.apache.hadoop.yarn.server.timelineservice.storage.TestHBaseTimelineStorageDomain
FAILED:  org.apache.hadoop.yarn.server.timelineservice.storage.TestHBaseTimelineStorageEntities.org.apache.hadoop.yarn.server.timelineservice.storage.TestHBaseTimelineStorageEntities
FAILED:  org.apache.hadoop.yarn.server.timelineservice.storage.TestHBaseTimelineStorageSchema.org.apache.hadoop.yarn.server.timelineservice.storage.TestHBaseTimelineStorageSchema
FAILED:  org.apache.hadoop.yarn.server.timelineservice.storage.TestTimelineWriterHBaseDown.testTimelineWriterHBaseDown
FAILED:  org.apache.hadoop.yarn.server.timelineservice.storage.flow.TestHBaseStorageFlowActivity.org.apache.hadoop.yarn.server.timelineservice.storage.flow.TestHBaseStorageFlowActivity
FAILED:  org.apache.hadoop.yarn.server.timelineservice.storage.flow.TestHBaseStorageFlowRun.org.apache.hadoop.yarn.server.timelineservice.storage.flow.TestHBaseStorageFlowRun
FAILED:  org.apache.hadoop.yarn.server.timelineservice.storage.flow.TestHBaseStorageFlowRunCompaction.org.apache.hadoop.yarn.server.timelineservice.storage.flow.TestHBaseStorageFlowRunCompaction


Complete test report can be accessed at https://builds.apache.org/job/Hadoop-qbt-linux-ARM-trunk/67/testReport

IN ATTACHMENT COMPRESSED BUILD LOGS.
Mime
View raw message