hadoop-hdfs-dev mailing list archives

Site index · List index
Message view « Date » · « Thread »
Top « Date » · « Thread »
From Apache Jenkins Server <jenk...@builds.apache.org>
Subject Apache Hadoop qbt Report: trunk+JDK8 on Linux/aarch
Date Wed, 15 Jan 2020 01:26:22 GMT
ARM Build Details : https://builds.apache.org/job/Hadoop-qbt-linux-ARM-trunk/79/

============================ 
CHANGES 
============================ 

[Jan 13, 2020 4:15:09 PM] (snemeth) YARN-9868. Validate %primary_group queue in CS queue manager.
[Jan 13, 2020 4:23:00 PM] (snemeth) YARN-9912. Capacity scheduler: support u:user2:%secondary_group
queue
[Jan 13, 2020 6:48:53 PM] (weichiu) HDFS-15097. Purge log in KMS and HttpFS. Contributed by
Doris Gu.
[Jan 14, 2020 10:00:08 AM] (snemeth) YARN-10028. Integrate the new abstract log servlet to
the JobHistory
[Jan 14, 2020 11:26:03 AM] (snemeth) YARN-9788. Queue Management API does not support parallel
updates.


============================ 
TESTS 
============================ 

There are 23514 total tests of which 13 test(s) failed and 2460 test(s) were skipped.  

============================ 
FAILED TESTS 
============================ 

13 tests failed.
FAILED:  org.apache.hadoop.hdfs.server.federation.security.TestRouterSecurityManager.testCreateCredentials
FAILED:  org.apache.hadoop.mapreduce.v2.TestSpeculativeExecutionWithMRApp.testSpeculateSuccessfulWithUpdateEvents[0:
TaskEstimator(EstimatorClass class org.apache.hadoop.mapreduce.v2.app.speculate.SimpleExponentialTaskRuntimeEstimator)]
FAILED:  org.apache.hadoop.yarn.applications.distributedshell.TestDistributedShell.testDSShellWithOpportunisticContainers
FAILED:  org.apache.hadoop.yarn.applications.distributedshell.TestDistributedShell.testDSShellWithEnforceExecutionType
FAILED:  org.apache.hadoop.yarn.server.timelineservice.reader.TestTimelineReaderWebServicesHBaseStorage.org.apache.hadoop.yarn.server.timelineservice.reader.TestTimelineReaderWebServicesHBaseStorage
FAILED:  org.apache.hadoop.yarn.server.timelineservice.storage.TestHBaseTimelineStorageApps.org.apache.hadoop.yarn.server.timelineservice.storage.TestHBaseTimelineStorageApps
FAILED:  org.apache.hadoop.yarn.server.timelineservice.storage.TestHBaseTimelineStorageDomain.org.apache.hadoop.yarn.server.timelineservice.storage.TestHBaseTimelineStorageDomain
FAILED:  org.apache.hadoop.yarn.server.timelineservice.storage.TestHBaseTimelineStorageEntities.org.apache.hadoop.yarn.server.timelineservice.storage.TestHBaseTimelineStorageEntities
FAILED:  org.apache.hadoop.yarn.server.timelineservice.storage.TestHBaseTimelineStorageSchema.org.apache.hadoop.yarn.server.timelineservice.storage.TestHBaseTimelineStorageSchema
FAILED:  org.apache.hadoop.yarn.server.timelineservice.storage.TestTimelineWriterHBaseDown.testTimelineWriterHBaseDown
FAILED:  org.apache.hadoop.yarn.server.timelineservice.storage.flow.TestHBaseStorageFlowActivity.org.apache.hadoop.yarn.server.timelineservice.storage.flow.TestHBaseStorageFlowActivity
FAILED:  org.apache.hadoop.yarn.server.timelineservice.storage.flow.TestHBaseStorageFlowRun.org.apache.hadoop.yarn.server.timelineservice.storage.flow.TestHBaseStorageFlowRun
FAILED:  org.apache.hadoop.yarn.server.timelineservice.storage.flow.TestHBaseStorageFlowRunCompaction.org.apache.hadoop.yarn.server.timelineservice.storage.flow.TestHBaseStorageFlowRunCompaction


Complete test report can be accessed at https://builds.apache.org/job/Hadoop-qbt-linux-ARM-trunk/79/testReport

IN ATTACHMENT COMPRESSED BUILD LOGS.
Mime
View raw message