hadoop-hdfs-dev mailing list archives

Site index · List index
Message view « Date » · « Thread »
Top « Date » · « Thread »
From Apache Jenkins Server <jenk...@builds.apache.org>
Subject Apache Hadoop qbt Report: trunk+JDK8 on Linux/aarch
Date Thu, 09 Jan 2020 01:07:18 GMT
ARM Build Details : https://builds.apache.org/job/Hadoop-qbt-linux-ARM-trunk/73/

============================ 
CHANGES 
============================ 

[Jan 7, 2020 6:05:47 PM] (stevel) HADOOP-16699. Add verbose TRACE logging to ABFS.
[Jan 7, 2020 11:46:14 PM] (hanishakoneru) HADOOP-16727. KMS Jetty server does not startup
if trust store password
[Jan 8, 2020 2:28:34 AM] (aajisaka) HDFS-15072. HDFS MiniCluster fails to start when run in
directory path
[Jan 8, 2020 6:31:30 AM] (pjoseph) YARN-10068. Fix TimelineV2Client leaking File Descriptors.
[Jan 8, 2020 7:45:39 AM] (github) HDFS-15077. Fix intermittent failure of
[Jan 8, 2020 8:55:17 AM] (rakeshr) HDFS-15080. Fix the issue in reading persistent memory
cached data with
[Jan 8, 2020 11:25:01 AM] (gabor.bota) HADOOP-16772. Extract version numbers to head of pom.xml
(addendum)
[Jan 8, 2020 11:32:31 AM] (github) HADOOP-16751. Followup: move java import. (#1799)
[Jan 8, 2020 11:46:54 AM] (stevel) HADOOP-16785. Improve wasb and abfs resilience on double
close() calls.
[Jan 8, 2020 2:28:20 PM] (stevel) HADOOP-16642. ITestDynamoDBMetadataStoreScale fails when
throttled.


============================ 
TESTS 
============================ 

There are 23441 total tests of which 12 test(s) failed and 2460 test(s) were skipped.  

============================ 
FAILED TESTS 
============================ 

12 tests failed.
FAILED:  org.apache.hadoop.hdfs.server.namenode.ha.TestBootstrapAliasmap.testAliasmapBootstrap
FAILED:  org.apache.hadoop.yarn.applications.distributedshell.TestDistributedShell.testDSShellWithOpportunisticContainers
FAILED:  org.apache.hadoop.yarn.applications.distributedshell.TestDistributedShell.testDSShellWithEnforceExecutionType
FAILED:  org.apache.hadoop.yarn.server.timelineservice.reader.TestTimelineReaderWebServicesHBaseStorage.org.apache.hadoop.yarn.server.timelineservice.reader.TestTimelineReaderWebServicesHBaseStorage
FAILED:  org.apache.hadoop.yarn.server.timelineservice.storage.TestHBaseTimelineStorageApps.org.apache.hadoop.yarn.server.timelineservice.storage.TestHBaseTimelineStorageApps
FAILED:  org.apache.hadoop.yarn.server.timelineservice.storage.TestHBaseTimelineStorageDomain.org.apache.hadoop.yarn.server.timelineservice.storage.TestHBaseTimelineStorageDomain
FAILED:  org.apache.hadoop.yarn.server.timelineservice.storage.TestHBaseTimelineStorageEntities.org.apache.hadoop.yarn.server.timelineservice.storage.TestHBaseTimelineStorageEntities
FAILED:  org.apache.hadoop.yarn.server.timelineservice.storage.TestHBaseTimelineStorageSchema.org.apache.hadoop.yarn.server.timelineservice.storage.TestHBaseTimelineStorageSchema
FAILED:  org.apache.hadoop.yarn.server.timelineservice.storage.TestTimelineWriterHBaseDown.testTimelineWriterHBaseDown
FAILED:  org.apache.hadoop.yarn.server.timelineservice.storage.flow.TestHBaseStorageFlowActivity.org.apache.hadoop.yarn.server.timelineservice.storage.flow.TestHBaseStorageFlowActivity
FAILED:  org.apache.hadoop.yarn.server.timelineservice.storage.flow.TestHBaseStorageFlowRun.org.apache.hadoop.yarn.server.timelineservice.storage.flow.TestHBaseStorageFlowRun
FAILED:  org.apache.hadoop.yarn.server.timelineservice.storage.flow.TestHBaseStorageFlowRunCompaction.org.apache.hadoop.yarn.server.timelineservice.storage.flow.TestHBaseStorageFlowRunCompaction


Complete test report can be accessed at https://builds.apache.org/job/Hadoop-qbt-linux-ARM-trunk/73/testReport

IN ATTACHMENT COMPRESSED BUILD LOGS.
Mime
View raw message