hadoop-hdfs-dev mailing list archives

Site index · List index
Message view « Date » · « Thread »
Top « Date » · « Thread »
From Apache Jenkins Server <jenk...@builds.apache.org>
Subject Apache Hadoop qbt Report: trunk+JDK8 on Linux/aarch
Date Sun, 12 Jan 2020 01:15:04 GMT
ARM Build Details : https://builds.apache.org/job/Hadoop-qbt-linux-ARM-trunk/76/

============================ 
CHANGES 
============================ 

[Jan 10, 2020 4:31:39 PM] (jeagles) HADOOP-16749. Configuration parsing of CDATA values are
blank
[Jan 10, 2020 6:43:21 PM] (kihwal) HDFS-15095. Fix TestDecommissioningStatus. Contributed
by Ahmed Hussein.
[Jan 10, 2020 7:33:12 PM] (eyang) HADOOP-16590.  Update OS login modules for IBM JDK.    
          
[Jan 11, 2020 12:04:04 AM] (eyang) YARN-10019.  Improved container-executor exec() calls.
            
[Jan 11, 2020 1:06:59 AM] (shv) HDFS-15099. [SBN Read] checkOperation(WRITE) should throw
[Jan 11, 2020 4:51:31 AM] (ayushsaxena) HDFS-15108. RBF: MembershipNamenodeResolver should
invalidate cache
[Jan 11, 2020 4:59:11 AM] (ayushsaxena) HDFS-14578. AvailableSpaceBlockPlacementPolicy always
prefers local


============================ 
TESTS 
============================ 

There are 23502 total tests of which 11 test(s) failed and 2459 test(s) were skipped.  

============================ 
FAILED TESTS 
============================ 

11 tests failed.
FAILED:  org.apache.hadoop.yarn.applications.distributedshell.TestDistributedShell.testDSShellWithOpportunisticContainers
FAILED:  org.apache.hadoop.yarn.applications.distributedshell.TestDistributedShell.testDSShellWithEnforceExecutionType
FAILED:  org.apache.hadoop.yarn.server.timelineservice.reader.TestTimelineReaderWebServicesHBaseStorage.org.apache.hadoop.yarn.server.timelineservice.reader.TestTimelineReaderWebServicesHBaseStorage
FAILED:  org.apache.hadoop.yarn.server.timelineservice.storage.TestHBaseTimelineStorageApps.org.apache.hadoop.yarn.server.timelineservice.storage.TestHBaseTimelineStorageApps
FAILED:  org.apache.hadoop.yarn.server.timelineservice.storage.TestHBaseTimelineStorageDomain.org.apache.hadoop.yarn.server.timelineservice.storage.TestHBaseTimelineStorageDomain
FAILED:  org.apache.hadoop.yarn.server.timelineservice.storage.TestHBaseTimelineStorageEntities.org.apache.hadoop.yarn.server.timelineservice.storage.TestHBaseTimelineStorageEntities
FAILED:  org.apache.hadoop.yarn.server.timelineservice.storage.TestHBaseTimelineStorageSchema.org.apache.hadoop.yarn.server.timelineservice.storage.TestHBaseTimelineStorageSchema
FAILED:  org.apache.hadoop.yarn.server.timelineservice.storage.TestTimelineWriterHBaseDown.testTimelineWriterHBaseDown
FAILED:  org.apache.hadoop.yarn.server.timelineservice.storage.flow.TestHBaseStorageFlowActivity.org.apache.hadoop.yarn.server.timelineservice.storage.flow.TestHBaseStorageFlowActivity
FAILED:  org.apache.hadoop.yarn.server.timelineservice.storage.flow.TestHBaseStorageFlowRun.org.apache.hadoop.yarn.server.timelineservice.storage.flow.TestHBaseStorageFlowRun
FAILED:  org.apache.hadoop.yarn.server.timelineservice.storage.flow.TestHBaseStorageFlowRunCompaction.org.apache.hadoop.yarn.server.timelineservice.storage.flow.TestHBaseStorageFlowRunCompaction


Complete test report can be accessed at https://builds.apache.org/job/Hadoop-qbt-linux-ARM-trunk/76/testReport

IN ATTACHMENT COMPRESSED BUILD LOGS.
Mime
View raw message