hadoop-hdfs-dev mailing list archives

Site index · List index
Message view « Date » · « Thread »
Top « Date » · « Thread »
From Apache Jenkins Server <jenk...@builds.apache.org>
Subject Apache Hadoop qbt Report: trunk+JDK8 on Linux/aarch
Date Wed, 29 Jan 2020 01:35:07 GMT
ARM Build Details : https://builds.apache.org/job/Hadoop-qbt-linux-ARM-trunk/93/

============================ 
CHANGES 
============================ 

[Jan 27, 2020 9:50:13 PM] (jeagles) MAPREDUCE-7262. MRApp helpers block for long intervals
(500ms)
[Jan 28, 2020 2:04:21 PM] (ayushsaxena) HDFS-15143. LocatedStripedBlock returns wrong block
type. Contributed by
[Jan 28, 2020 2:22:48 PM] (snemeth) YARN-10085. FS-CS converter: remove mixed ordering policy
check.
[Jan 28, 2020 2:36:04 PM] (snemeth) YARN-10104. FS-CS converter: dry run should work without
output defined.


============================ 
TESTS 
============================ 

There are 23582 total tests of which 12 test(s) failed and 2473 test(s) were skipped.  

============================ 
FAILED TESTS 
============================ 

12 tests failed.
FAILED:  org.apache.hadoop.mapreduce.v2.TestSpeculativeExecutionWithMRApp.testSpeculateSuccessfulWithUpdateEvents[0:
TaskEstimator(EstimatorClass class org.apache.hadoop.mapreduce.v2.app.speculate.SimpleExponentialTaskRuntimeEstimator)]
FAILED:  org.apache.hadoop.yarn.applications.distributedshell.TestDistributedShell.testDSShellWithOpportunisticContainers
FAILED:  org.apache.hadoop.yarn.applications.distributedshell.TestDistributedShell.testDSShellWithEnforceExecutionType
FAILED:  org.apache.hadoop.yarn.server.timelineservice.reader.TestTimelineReaderWebServicesHBaseStorage.org.apache.hadoop.yarn.server.timelineservice.reader.TestTimelineReaderWebServicesHBaseStorage
FAILED:  org.apache.hadoop.yarn.server.timelineservice.storage.TestHBaseTimelineStorageApps.org.apache.hadoop.yarn.server.timelineservice.storage.TestHBaseTimelineStorageApps
FAILED:  org.apache.hadoop.yarn.server.timelineservice.storage.TestHBaseTimelineStorageDomain.org.apache.hadoop.yarn.server.timelineservice.storage.TestHBaseTimelineStorageDomain
FAILED:  org.apache.hadoop.yarn.server.timelineservice.storage.TestHBaseTimelineStorageEntities.org.apache.hadoop.yarn.server.timelineservice.storage.TestHBaseTimelineStorageEntities
FAILED:  org.apache.hadoop.yarn.server.timelineservice.storage.TestHBaseTimelineStorageSchema.org.apache.hadoop.yarn.server.timelineservice.storage.TestHBaseTimelineStorageSchema
FAILED:  org.apache.hadoop.yarn.server.timelineservice.storage.TestTimelineWriterHBaseDown.testTimelineWriterHBaseDown
FAILED:  org.apache.hadoop.yarn.server.timelineservice.storage.flow.TestHBaseStorageFlowActivity.org.apache.hadoop.yarn.server.timelineservice.storage.flow.TestHBaseStorageFlowActivity
FAILED:  org.apache.hadoop.yarn.server.timelineservice.storage.flow.TestHBaseStorageFlowRun.org.apache.hadoop.yarn.server.timelineservice.storage.flow.TestHBaseStorageFlowRun
FAILED:  org.apache.hadoop.yarn.server.timelineservice.storage.flow.TestHBaseStorageFlowRunCompaction.org.apache.hadoop.yarn.server.timelineservice.storage.flow.TestHBaseStorageFlowRunCompaction


Complete test report can be accessed at https://builds.apache.org/job/Hadoop-qbt-linux-ARM-trunk/93/testReport

IN ATTACHMENT COMPRESSED BUILD LOGS.
Mime
View raw message