hadoop-hdfs-dev mailing list archives

Site index · List index
Message view « Date » · « Thread »
Top « Date » · « Thread »
From Apache Jenkins Server <jenk...@builds.apache.org>
Subject Apache Hadoop qbt Report: trunk+JDK8 on Linux/aarch
Date Fri, 10 Jan 2020 01:17:33 GMT
ARM Build Details : https://builds.apache.org/job/Hadoop-qbt-linux-ARM-trunk/74/

============================ 
CHANGES 
============================ 

[Jan 8, 2020 5:08:13 PM] (jeagles) MAPREDUCE-7252. Handling 0 progress in SimpleExponential
task runtime
[Jan 8, 2020 5:29:56 PM] (ericp) YARN-10072: TestCSAllocateCustomResource failures. Contributed
by Jim
[Jan 8, 2020 7:26:01 PM] (ericp) YARN-7387:
[Jan 9, 2020 2:56:51 AM] (ayushsaxena) HDFS-15096. RBF: GetServerDefaults Should be Cached
At Router.
[Jan 9, 2020 3:32:38 AM] (ayushsaxena) HDFS-15094. RBF: Reuse ugi string in ConnectionPoolID.
Contributed by
[Jan 9, 2020 6:34:05 AM] (surendralilhore) HDFS-14957. INodeReference Space Consumed was not
same in QuotaUsage and
[Jan 9, 2020 7:24:58 AM] (tasanuma) HADOOP-15993. Upgrade Kafka to 2.4.0 in hadoop-kafka module.
(#1796)


============================ 
TESTS 
============================ 

There are 23496 total tests of which 11 test(s) failed and 2460 test(s) were skipped.  

============================ 
FAILED TESTS 
============================ 

11 tests failed.
FAILED:  org.apache.hadoop.yarn.applications.distributedshell.TestDistributedShell.testDSShellWithOpportunisticContainers
FAILED:  org.apache.hadoop.yarn.applications.distributedshell.TestDistributedShell.testDSShellWithEnforceExecutionType
FAILED:  org.apache.hadoop.yarn.server.timelineservice.reader.TestTimelineReaderWebServicesHBaseStorage.org.apache.hadoop.yarn.server.timelineservice.reader.TestTimelineReaderWebServicesHBaseStorage
FAILED:  org.apache.hadoop.yarn.server.timelineservice.storage.TestHBaseTimelineStorageApps.org.apache.hadoop.yarn.server.timelineservice.storage.TestHBaseTimelineStorageApps
FAILED:  org.apache.hadoop.yarn.server.timelineservice.storage.TestHBaseTimelineStorageDomain.org.apache.hadoop.yarn.server.timelineservice.storage.TestHBaseTimelineStorageDomain
FAILED:  org.apache.hadoop.yarn.server.timelineservice.storage.TestHBaseTimelineStorageEntities.org.apache.hadoop.yarn.server.timelineservice.storage.TestHBaseTimelineStorageEntities
FAILED:  org.apache.hadoop.yarn.server.timelineservice.storage.TestHBaseTimelineStorageSchema.org.apache.hadoop.yarn.server.timelineservice.storage.TestHBaseTimelineStorageSchema
FAILED:  org.apache.hadoop.yarn.server.timelineservice.storage.TestTimelineWriterHBaseDown.testTimelineWriterHBaseDown
FAILED:  org.apache.hadoop.yarn.server.timelineservice.storage.flow.TestHBaseStorageFlowActivity.org.apache.hadoop.yarn.server.timelineservice.storage.flow.TestHBaseStorageFlowActivity
FAILED:  org.apache.hadoop.yarn.server.timelineservice.storage.flow.TestHBaseStorageFlowRun.org.apache.hadoop.yarn.server.timelineservice.storage.flow.TestHBaseStorageFlowRun
FAILED:  org.apache.hadoop.yarn.server.timelineservice.storage.flow.TestHBaseStorageFlowRunCompaction.org.apache.hadoop.yarn.server.timelineservice.storage.flow.TestHBaseStorageFlowRunCompaction


Complete test report can be accessed at https://builds.apache.org/job/Hadoop-qbt-linux-ARM-trunk/74/testReport

IN ATTACHMENT COMPRESSED BUILD LOGS.
Mime
View raw message