hadoop-hdfs-dev mailing list archives

Site index · List index
Message view « Date » · « Thread »
Top « Date » · « Thread »
From Apache Jenkins Server <jenk...@builds.apache.org>
Subject Apache Hadoop qbt Report: trunk+JDK8 on Linux/aarch
Date Tue, 14 Jan 2020 01:19:49 GMT
ARM Build Details : https://builds.apache.org/job/Hadoop-qbt-linux-ARM-trunk/78/

============================ 
CHANGES 
============================ 

[Jan 13, 2020 5:10:29 AM] (github) HADOOP-16797. Add Dockerfile for ARM builds. Contributed
by Vinayakumar
[Jan 13, 2020 3:50:07 PM] (snemeth) YARN-9989. Typo in CapacityScheduler documentation: Runtime


============================ 
TESTS 
============================ 

There are 23511 total tests of which 86 test(s) failed and 2459 test(s) were skipped.  

============================ 
FAILED TESTS 
============================ 

86 tests failed.
FAILED:  org.apache.hadoop.fs.http.client.TestHttpFSFWithWebhdfsFileSystem.testOperation[1]
FAILED:  org.apache.hadoop.fs.http.client.TestHttpFSFWithWebhdfsFileSystem.testOperationDoAs[1]
FAILED:  org.apache.hadoop.fs.http.client.TestHttpFSFWithWebhdfsFileSystem.testOperation[2]
FAILED:  org.apache.hadoop.fs.http.client.TestHttpFSFWithWebhdfsFileSystem.testOperationDoAs[2]
FAILED:  org.apache.hadoop.fs.http.client.TestHttpFSFWithWebhdfsFileSystem.testOperation[3]
FAILED:  org.apache.hadoop.fs.http.client.TestHttpFSFWithWebhdfsFileSystem.testOperationDoAs[3]
FAILED:  org.apache.hadoop.fs.http.client.TestHttpFSFWithWebhdfsFileSystem.testOperation[5]
FAILED:  org.apache.hadoop.fs.http.client.TestHttpFSFWithWebhdfsFileSystem.testOperationDoAs[5]
FAILED:  org.apache.hadoop.fs.http.client.TestHttpFSFWithWebhdfsFileSystem.testOperation[6]
FAILED:  org.apache.hadoop.fs.http.client.TestHttpFSFWithWebhdfsFileSystem.testOperationDoAs[6]
FAILED:  org.apache.hadoop.fs.http.client.TestHttpFSFWithWebhdfsFileSystem.testOperation[7]
FAILED:  org.apache.hadoop.fs.http.client.TestHttpFSFWithWebhdfsFileSystem.testOperationDoAs[7]
FAILED:  org.apache.hadoop.fs.http.client.TestHttpFSFWithWebhdfsFileSystem.testOperation[8]
FAILED:  org.apache.hadoop.fs.http.client.TestHttpFSFWithWebhdfsFileSystem.testOperationDoAs[8]
FAILED:  org.apache.hadoop.fs.http.client.TestHttpFSFWithWebhdfsFileSystem.testOperation[10]
FAILED:  org.apache.hadoop.fs.http.client.TestHttpFSFWithWebhdfsFileSystem.testOperationDoAs[10]
FAILED:  org.apache.hadoop.fs.http.client.TestHttpFSFWithWebhdfsFileSystem.testOperation[11]
FAILED:  org.apache.hadoop.fs.http.client.TestHttpFSFWithWebhdfsFileSystem.testOperationDoAs[11]
FAILED:  org.apache.hadoop.fs.http.client.TestHttpFSFWithWebhdfsFileSystem.testOperation[12]
FAILED:  org.apache.hadoop.fs.http.client.TestHttpFSFWithWebhdfsFileSystem.testOperationDoAs[12]
FAILED:  org.apache.hadoop.fs.http.client.TestHttpFSFWithWebhdfsFileSystem.testOperation[13]
FAILED:  org.apache.hadoop.fs.http.client.TestHttpFSFWithWebhdfsFileSystem.testOperationDoAs[13]
FAILED:  org.apache.hadoop.fs.http.client.TestHttpFSFWithWebhdfsFileSystem.testOperation[14]
FAILED:  org.apache.hadoop.fs.http.client.TestHttpFSFWithWebhdfsFileSystem.testOperationDoAs[14]
FAILED:  org.apache.hadoop.fs.http.client.TestHttpFSFWithWebhdfsFileSystem.testOperation[15]
FAILED:  org.apache.hadoop.fs.http.client.TestHttpFSFWithWebhdfsFileSystem.testOperationDoAs[15]
FAILED:  org.apache.hadoop.fs.http.client.TestHttpFSFWithWebhdfsFileSystem.testOperation[16]
FAILED:  org.apache.hadoop.fs.http.client.TestHttpFSFWithWebhdfsFileSystem.testOperationDoAs[16]
FAILED:  org.apache.hadoop.fs.http.client.TestHttpFSFWithWebhdfsFileSystem.testOperation[17]
FAILED:  org.apache.hadoop.fs.http.client.TestHttpFSFWithWebhdfsFileSystem.testOperationDoAs[17]
FAILED:  org.apache.hadoop.fs.http.client.TestHttpFSFWithWebhdfsFileSystem.testOperation[18]
FAILED:  org.apache.hadoop.fs.http.client.TestHttpFSFWithWebhdfsFileSystem.testOperationDoAs[18]
FAILED:  org.apache.hadoop.fs.http.client.TestHttpFSFWithWebhdfsFileSystem.testOperation[19]
FAILED:  org.apache.hadoop.fs.http.client.TestHttpFSFWithWebhdfsFileSystem.testOperationDoAs[19]
FAILED:  org.apache.hadoop.fs.http.client.TestHttpFSFWithWebhdfsFileSystem.testOperation[20]
FAILED:  org.apache.hadoop.fs.http.client.TestHttpFSFWithWebhdfsFileSystem.testOperationDoAs[20]
FAILED:  org.apache.hadoop.fs.http.client.TestHttpFSFWithWebhdfsFileSystem.testOperation[21]
FAILED:  org.apache.hadoop.fs.http.client.TestHttpFSFWithWebhdfsFileSystem.testOperationDoAs[21]
FAILED:  org.apache.hadoop.fs.http.client.TestHttpFSFWithWebhdfsFileSystem.testOperation[22]
FAILED:  org.apache.hadoop.fs.http.client.TestHttpFSFWithWebhdfsFileSystem.testOperationDoAs[22]
FAILED:  org.apache.hadoop.fs.http.client.TestHttpFSFWithWebhdfsFileSystem.testOperation[23]
FAILED:  org.apache.hadoop.fs.http.client.TestHttpFSFWithWebhdfsFileSystem.testOperationDoAs[23]
FAILED:  org.apache.hadoop.fs.http.client.TestHttpFSFWithWebhdfsFileSystem.testOperation[24]
FAILED:  org.apache.hadoop.fs.http.client.TestHttpFSFWithWebhdfsFileSystem.testOperationDoAs[24]
FAILED:  org.apache.hadoop.fs.http.client.TestHttpFSFWithWebhdfsFileSystem.testOperation[25]
FAILED:  org.apache.hadoop.fs.http.client.TestHttpFSFWithWebhdfsFileSystem.testOperationDoAs[25]
FAILED:  org.apache.hadoop.fs.http.client.TestHttpFSFWithWebhdfsFileSystem.testOperation[27]
FAILED:  org.apache.hadoop.fs.http.client.TestHttpFSFWithWebhdfsFileSystem.testOperationDoAs[27]
FAILED:  org.apache.hadoop.fs.http.client.TestHttpFSFWithWebhdfsFileSystem.testOperation[28]
FAILED:  org.apache.hadoop.fs.http.client.TestHttpFSFWithWebhdfsFileSystem.testOperationDoAs[28]
FAILED:  org.apache.hadoop.fs.http.client.TestHttpFSFWithWebhdfsFileSystem.testOperation[29]
FAILED:  org.apache.hadoop.fs.http.client.TestHttpFSFWithWebhdfsFileSystem.testOperationDoAs[29]
FAILED:  org.apache.hadoop.fs.http.client.TestHttpFSFWithWebhdfsFileSystem.testOperation[30]
FAILED:  org.apache.hadoop.fs.http.client.TestHttpFSFWithWebhdfsFileSystem.testOperationDoAs[30]
FAILED:  org.apache.hadoop.fs.http.client.TestHttpFSFWithWebhdfsFileSystem.testOperation[31]
FAILED:  org.apache.hadoop.fs.http.client.TestHttpFSFWithWebhdfsFileSystem.testOperationDoAs[31]
FAILED:  org.apache.hadoop.fs.http.client.TestHttpFSFWithWebhdfsFileSystem.testOperation[32]
FAILED:  org.apache.hadoop.fs.http.client.TestHttpFSFWithWebhdfsFileSystem.testOperationDoAs[32]
FAILED:  org.apache.hadoop.fs.http.client.TestHttpFSFWithWebhdfsFileSystem.testOperation[33]
FAILED:  org.apache.hadoop.fs.http.client.TestHttpFSFWithWebhdfsFileSystem.testOperationDoAs[33]
FAILED:  org.apache.hadoop.fs.http.client.TestHttpFSFWithWebhdfsFileSystem.testOperation[34]
FAILED:  org.apache.hadoop.fs.http.client.TestHttpFSFWithWebhdfsFileSystem.testOperationDoAs[34]
FAILED:  org.apache.hadoop.fs.http.client.TestHttpFSFWithWebhdfsFileSystem.testOperation[35]
FAILED:  org.apache.hadoop.fs.http.client.TestHttpFSFWithWebhdfsFileSystem.testOperationDoAs[35]
FAILED:  org.apache.hadoop.fs.http.client.TestHttpFSFWithWebhdfsFileSystem.testOperation[36]
FAILED:  org.apache.hadoop.fs.http.client.TestHttpFSFWithWebhdfsFileSystem.testOperationDoAs[36]
FAILED:  org.apache.hadoop.fs.http.client.TestHttpFSFWithWebhdfsFileSystem.testOperation[37]
FAILED:  org.apache.hadoop.fs.http.client.TestHttpFSFWithWebhdfsFileSystem.testOperationDoAs[37]
FAILED:  org.apache.hadoop.fs.http.client.TestHttpFSFWithWebhdfsFileSystem.testOperation[38]
FAILED:  org.apache.hadoop.fs.http.client.TestHttpFSFWithWebhdfsFileSystem.testOperationDoAs[38]
FAILED:  org.apache.hadoop.fs.http.client.TestHttpFSFWithWebhdfsFileSystem.testOperation[39]
FAILED:  org.apache.hadoop.fs.http.client.TestHttpFSFWithWebhdfsFileSystem.testOperationDoAs[39]
FAILED:  org.apache.hadoop.fs.http.client.TestHttpFSFWithWebhdfsFileSystem.testOperation[40]
FAILED:  org.apache.hadoop.fs.http.client.TestHttpFSFWithWebhdfsFileSystem.testOperationDoAs[40]
FAILED:  org.apache.hadoop.mapreduce.v2.TestSpeculativeExecutionWithMRApp.testSpeculateSuccessfulWithUpdateEvents[0:
TaskEstimator(EstimatorClass class org.apache.hadoop.mapreduce.v2.app.speculate.SimpleExponentialTaskRuntimeEstimator)]
FAILED:  org.apache.hadoop.yarn.applications.distributedshell.TestDistributedShell.testDSShellWithOpportunisticContainers
FAILED:  org.apache.hadoop.yarn.applications.distributedshell.TestDistributedShell.testDSShellWithEnforceExecutionType
FAILED:  org.apache.hadoop.yarn.server.timelineservice.reader.TestTimelineReaderWebServicesHBaseStorage.org.apache.hadoop.yarn.server.timelineservice.reader.TestTimelineReaderWebServicesHBaseStorage
FAILED:  org.apache.hadoop.yarn.server.timelineservice.storage.TestHBaseTimelineStorageApps.org.apache.hadoop.yarn.server.timelineservice.storage.TestHBaseTimelineStorageApps
FAILED:  org.apache.hadoop.yarn.server.timelineservice.storage.TestHBaseTimelineStorageDomain.org.apache.hadoop.yarn.server.timelineservice.storage.TestHBaseTimelineStorageDomain
FAILED:  org.apache.hadoop.yarn.server.timelineservice.storage.TestHBaseTimelineStorageEntities.org.apache.hadoop.yarn.server.timelineservice.storage.TestHBaseTimelineStorageEntities
FAILED:  org.apache.hadoop.yarn.server.timelineservice.storage.TestHBaseTimelineStorageSchema.org.apache.hadoop.yarn.server.timelineservice.storage.TestHBaseTimelineStorageSchema
FAILED:  org.apache.hadoop.yarn.server.timelineservice.storage.TestTimelineWriterHBaseDown.testTimelineWriterHBaseDown
FAILED:  org.apache.hadoop.yarn.server.timelineservice.storage.flow.TestHBaseStorageFlowActivity.org.apache.hadoop.yarn.server.timelineservice.storage.flow.TestHBaseStorageFlowActivity
FAILED:  org.apache.hadoop.yarn.server.timelineservice.storage.flow.TestHBaseStorageFlowRun.org.apache.hadoop.yarn.server.timelineservice.storage.flow.TestHBaseStorageFlowRun
FAILED:  org.apache.hadoop.yarn.server.timelineservice.storage.flow.TestHBaseStorageFlowRunCompaction.org.apache.hadoop.yarn.server.timelineservice.storage.flow.TestHBaseStorageFlowRunCompaction


Complete test report can be accessed at https://builds.apache.org/job/Hadoop-qbt-linux-ARM-trunk/78/testReport

IN ATTACHMENT COMPRESSED BUILD LOGS.
Mime
View raw message