hadoop-hdfs-dev mailing list archives

Site index · List index
Message view « Date » · « Thread »
Top « Date » · « Thread »
From "Anbang Hu (JIRA)" <j...@apache.org>
Subject [jira] [Created] (HDFS-13548) TestResolveHdfsSymlink#testFcResolveAfs fails on Windows
Date Mon, 14 May 2018 23:28:00 GMT
Anbang Hu created HDFS-13548:
--------------------------------

             Summary: TestResolveHdfsSymlink#testFcResolveAfs fails on Windows
                 Key: HDFS-13548
                 URL: https://issues.apache.org/jira/browse/HDFS-13548
             Project: Hadoop HDFS
          Issue Type: Bug
            Reporter: Anbang Hu
            Assignee: Anbang Hu


{color:#333333}TestResolveHdfsSymlink#testFcResolveAfs fails on Windows with error message:{color}

{color:#d04437}[INFO] Running org.apache.hadoop.fs.TestResolveHdfsSymlink{color}
{color:#d04437}[ERROR] Tests run: 1, Failures: 0, Errors: 1, Skipped: 0, Time elapsed: 28.574
s <<< FAILURE! - in org.apache.hadoop.fs.TestResolveHdfsSymlink{color}
{color:#d04437}[ERROR] testFcResolveAfs(org.apache.hadoop.fs.TestResolveHdfsSymlink) Time
elapsed: 0.039 s <<< ERROR!{color}
{color:#d04437}java.io.IOException: Mkdirs failed to create file:/E:/OSS/hadoop-branch-2/hadoop-hdfs-project/hadoop-hdfs/file:/E:/OSS/hadoop-branch-2/hadoop-hdfs-project/hadoop-hdfs/target/test/data/n014HnmeeA{color}
{color:#d04437} at org.apache.hadoop.hdfs.DFSTestUtil.createFile(DFSTestUtil.java:360){color}
{color:#d04437} at org.apache.hadoop.fs.TestResolveHdfsSymlink.testFcResolveAfs(TestResolveHdfsSymlink.java:88){color}
{color:#d04437} at sun.reflect.NativeMethodAccessorImpl.invoke0(Native Method){color}
{color:#d04437} at sun.reflect.NativeMethodAccessorImpl.invoke(NativeMethodAccessorImpl.java:62){color}
{color:#d04437} at sun.reflect.DelegatingMethodAccessorImpl.invoke(DelegatingMethodAccessorImpl.java:43){color}
{color:#d04437} at java.lang.reflect.Method.invoke(Method.java:498){color}
{color:#d04437} at org.junit.runners.model.FrameworkMethod$1.runReflectiveCall(FrameworkMethod.java:47){color}
{color:#d04437} at org.junit.internal.runners.model.ReflectiveCallable.run(ReflectiveCallable.java:12){color}
{color:#d04437} at org.junit.runners.model.FrameworkMethod.invokeExplosively(FrameworkMethod.java:44){color}
{color:#d04437} at org.junit.internal.runners.statements.InvokeMethod.evaluate(InvokeMethod.java:17){color}
{color:#d04437} at org.junit.runners.ParentRunner.runLeaf(ParentRunner.java:271){color}
{color:#d04437} at org.junit.runners.BlockJUnit4ClassRunner.runChild(BlockJUnit4ClassRunner.java:70){color}
{color:#d04437} at org.junit.runners.BlockJUnit4ClassRunner.runChild(BlockJUnit4ClassRunner.java:50){color}
{color:#d04437} at org.junit.runners.ParentRunner$3.run(ParentRunner.java:238){color}
{color:#d04437} at org.junit.runners.ParentRunner$1.schedule(ParentRunner.java:63){color}
{color:#d04437} at org.junit.runners.ParentRunner.runChildren(ParentRunner.java:236){color}
{color:#d04437} at org.junit.runners.ParentRunner.access$000(ParentRunner.java:53){color}
{color:#d04437} at org.junit.runners.ParentRunner$2.evaluate(ParentRunner.java:229){color}
{color:#d04437} at org.junit.internal.runners.statements.RunBefores.evaluate(RunBefores.java:26){color}
{color:#d04437} at org.junit.internal.runners.statements.RunAfters.evaluate(RunAfters.java:27){color}
{color:#d04437} at org.junit.runners.ParentRunner.run(ParentRunner.java:309){color}
{color:#d04437} at org.apache.maven.surefire.junit4.JUnit4Provider.execute(JUnit4Provider.java:365){color}
{color:#d04437} at org.apache.maven.surefire.junit4.JUnit4Provider.executeWithRerun(JUnit4Provider.java:273){color}
{color:#d04437} at org.apache.maven.surefire.junit4.JUnit4Provider.executeTestSet(JUnit4Provider.java:238){color}
{color:#d04437} at org.apache.maven.surefire.junit4.JUnit4Provider.invoke(JUnit4Provider.java:159){color}
{color:#d04437} at org.apache.maven.surefire.booter.ForkedBooter.invokeProviderInSameClassLoader(ForkedBooter.java:379){color}
{color:#d04437} at org.apache.maven.surefire.booter.ForkedBooter.runSuitesInProcess(ForkedBooter.java:340){color}
{color:#d04437} at org.apache.maven.surefire.booter.ForkedBooter.execute(ForkedBooter.java:125){color}
{color:#d04437} at org.apache.maven.surefire.booter.ForkedBooter.main(ForkedBooter.java:413){color}

{color:#d04437}[INFO]{color}
{color:#d04437}[INFO] Results:{color}
{color:#d04437}[INFO]{color}
{color:#d04437}[ERROR] Errors:{color}
{color:#d04437}[ERROR] TestResolveHdfsSymlink.testFcResolveAfs:88 â•— IO Mkdirs failed to
create file:/...{color}
{color:#d04437}[INFO]{color}
{color:#d04437}[ERROR] Tests run: 1, Failures: 0, Errors: 1, Skipped: 0{color}



--
This message was sent by Atlassian JIRA
(v7.6.3#76005)

---------------------------------------------------------------------
To unsubscribe, e-mail: hdfs-dev-unsubscribe@hadoop.apache.org
For additional commands, e-mail: hdfs-dev-help@hadoop.apache.org


Mime
View raw message