hadoop-hdfs-dev mailing list archives

Site index · List index
Message view « Date » · « Thread »
Top « Date » · « Thread »
From "Yongjun Zhang (JIRA)" <j...@apache.org>
Subject [jira] [Created] (HDFS-12360) TestLeaseRecoveryStriped.testLeaseRecovery failure
Date Sat, 26 Aug 2017 23:00:00 GMT
Yongjun Zhang created HDFS-12360:
------------------------------------

             Summary: TestLeaseRecoveryStriped.testLeaseRecovery failure
                 Key: HDFS-12360
                 URL: https://issues.apache.org/jira/browse/HDFS-12360
             Project: Hadoop HDFS
          Issue Type: Bug
            Reporter: Yongjun Zhang


TestLeaseRecoveryStriped.testLeaseRecovery failed:

{code}
-------------------------------------------------------
 T E S T S
-------------------------------------------------------
Running org.apache.hadoop.hdfs.TestLeaseRecoveryStriped
Tests run: 1, Failures: 1, Errors: 0, Skipped: 0, Time elapsed: 15.808 sec <<< FAILURE!
- in org.apache.hadoop.hdfs.TestLeaseRecoveryStriped
testLeaseRecovery(org.apache.hadoop.hdfs.TestLeaseRecoveryStriped)  Time elapsed: 15.509 sec
 <<< FAILURE!
java.lang.AssertionError: failed testCase at i=0, blockLengths=[10485760, 4194304, 6291456,
10485760, 11534336, 11534336, 6291456, 4194304, 3145728]
java.io.IOException: Failed: the number of failed blocks = 4 > the number of data blocks
= 3
	at org.apache.hadoop.hdfs.DFSStripedOutputStream.checkStreamers(DFSStripedOutputStream.java:393)
	at org.apache.hadoop.hdfs.DFSStripedOutputStream.handleStreamerFailure(DFSStripedOutputStream.java:411)
	at org.apache.hadoop.hdfs.DFSStripedOutputStream.flushAllInternals(DFSStripedOutputStream.java:1128)
	at org.apache.hadoop.hdfs.DFSStripedOutputStream.checkStreamerFailures(DFSStripedOutputStream.java:628)
	at org.apache.hadoop.hdfs.DFSStripedOutputStream.writeChunk(DFSStripedOutputStream.java:564)
	at org.apache.hadoop.fs.FSOutputSummer.writeChecksumChunks(FSOutputSummer.java:217)
	at org.apache.hadoop.fs.FSOutputSummer.flushBuffer(FSOutputSummer.java:164)
	at org.apache.hadoop.fs.FSOutputSummer.flushBuffer(FSOutputSummer.java:145)
	at org.apache.hadoop.fs.FSOutputSummer.write(FSOutputSummer.java:79)
	at org.apache.hadoop.fs.FSDataOutputStream$PositionCache.write(FSDataOutputStream.java:48)
	at java.io.DataOutputStream.write(DataOutputStream.java:88)
	at org.apache.hadoop.hdfs.TestLeaseRecoveryStriped.writePartialBlocks(TestLeaseRecoveryStriped.java:182)
	at org.apache.hadoop.hdfs.TestLeaseRecoveryStriped.runTest(TestLeaseRecoveryStriped.java:158)
	at org.apache.hadoop.hdfs.TestLeaseRecoveryStriped.testLeaseRecovery(TestLeaseRecoveryStriped.java:147)
	at sun.reflect.NativeMethodAccessorImpl.invoke0(Native Method)
	at sun.reflect.NativeMethodAccessorImpl.invoke(NativeMethodAccessorImpl.java:62)
	at sun.reflect.DelegatingMethodAccessorImpl.invoke(DelegatingMethodAccessorImpl.java:43)
	at java.lang.reflect.Method.invoke(Method.java:483)
	at org.junit.runners.model.FrameworkMethod$1.runReflectiveCall(FrameworkMethod.java:47)
	at org.junit.internal.runners.model.ReflectiveCallable.run(ReflectiveCallable.java:12)
	at org.junit.runners.model.FrameworkMethod.invokeExplosively(FrameworkMethod.java:44)
	at org.junit.internal.runners.statements.InvokeMethod.evaluate(InvokeMethod.java:17)
	at org.junit.internal.runners.statements.RunBefores.evaluate(RunBefores.java:26)
	at org.junit.internal.runners.statements.RunAfters.evaluate(RunAfters.java:27)
	at org.junit.runners.ParentRunner.runLeaf(ParentRunner.java:271)
	at org.junit.runners.BlockJUnit4ClassRunner.runChild(BlockJUnit4ClassRunner.java:70)
	at org.junit.runners.BlockJUnit4ClassRunner.runChild(BlockJUnit4ClassRunner.java:50)
	at org.junit.runners.ParentRunner$3.run(ParentRunner.java:238)
	at org.junit.runners.ParentRunner$1.schedule(ParentRunner.java:63)
	at org.junit.runners.ParentRunner.runChildren(ParentRunner.java:236)
	at org.junit.runners.ParentRunner.access$000(ParentRunner.java:53)
	at org.junit.runners.ParentRunner$2.evaluate(ParentRunner.java:229)
	at org.junit.runners.ParentRunner.run(ParentRunner.java:309)
	at org.apache.maven.surefire.junit4.JUnit4Provider.execute(JUnit4Provider.java:264)
	at org.apache.maven.surefire.junit4.JUnit4Provider.executeTestSet(JUnit4Provider.java:153)
	at org.apache.maven.surefire.junit4.JUnit4Provider.invoke(JUnit4Provider.java:124)
	at org.apache.maven.surefire.booter.ForkedBooter.invokeProviderInSameClassLoader(ForkedBooter.java:200)
	at org.apache.maven.surefire.booter.ForkedBooter.runSuitesInProcess(ForkedBooter.java:153)
	at org.apache.maven.surefire.booter.ForkedBooter.main(ForkedBooter.java:103)
	at org.junit.Assert.fail(Assert.java:88)
	at org.apache.hadoop.hdfs.TestLeaseRecoveryStriped.testLeaseRecovery(TestLeaseRecoveryStriped.java:152)

Results :

Failed tests: 
  TestLeaseRecoveryStriped.testLeaseRecovery:152 failed testCase at i=0, blockLengths=[10485760,
4194304, 6291456, 10485760, 11534336, 11534336, 6291456, 4194304, 3145728]
java.io.IOException: Failed: the number of failed blocks = 4 > the number of data blocks
= 3
	at org.apache.hadoop.hdfs.DFSStripedOutputStream.checkStreamers(DFSStripedOutputStream.java:393)
	at org.apache.hadoop.hdfs.DFSStripedOutputStream.handleStreamerFailure(DFSStripedOutputStream.java:411)
	at org.apache.hadoop.hdfs.DFSStripedOutputStream.flushAllInternals(DFSStripedOutputStream.java:1128)
	at org.apache.hadoop.hdfs.DFSStripedOutputStream.checkStreamerFailures(DFSStripedOutputStream.java:628)
	at org.apache.hadoop.hdfs.DFSStripedOutputStream.writeChunk(DFSStripedOutputStream.java:564)
	at org.apache.hadoop.fs.FSOutputSummer.writeChecksumChunks(FSOutputSummer.java:217)
	at org.apache.hadoop.fs.FSOutputSummer.flushBuffer(FSOutputSummer.java:164)
	at org.apache.hadoop.fs.FSOutputSummer.flushBuffer(FSOutputSummer.java:145)
	at org.apache.hadoop.fs.FSOutputSummer.write(FSOutputSummer.java:79)
	at org.apache.hadoop.fs.FSDataOutputStream$PositionCache.write(FSDataOutputStream.java:48)
	at java.io.DataOutputStream.write(DataOutputStream.java:88)
	at org.apache.hadoop.hdfs.TestLeaseRecoveryStriped.writePartialBlocks(TestLeaseRecoveryStriped.java:182)
	at org.apache.hadoop.hdfs.TestLeaseRecoveryStriped.runTest(TestLeaseRecoveryStriped.java:158)
	at org.apache.hadoop.hdfs.TestLeaseRecoveryStriped.testLeaseRecovery(TestLeaseRecoveryStriped.java:147)
	at sun.reflect.NativeMethodAccessorImpl.invoke0(Native Method)
	at sun.reflect.NativeMethodAccessorImpl.invoke(NativeMethodAccessorImpl.java:62)
	at sun.reflect.DelegatingMethodAccessorImpl.invoke(DelegatingMethodAccessorImpl.java:43)
	at java.lang.reflect.Method.invoke(Method.java:483)
	at org.junit.runners.model.FrameworkMethod$1.runReflectiveCall(FrameworkMethod.java:47)
	at org.junit.internal.runners.model.ReflectiveCallable.run(ReflectiveCallable.java:12)
	at org.junit.runners.model.FrameworkMethod.invokeExplosively(FrameworkMethod.java:44)
	at org.junit.internal.runners.statements.InvokeMethod.evaluate(InvokeMethod.java:17)
	at org.junit.internal.runners.statements.RunBefores.evaluate(RunBefores.java:26)
	at org.junit.internal.runners.statements.RunAfters.evaluate(RunAfters.java:27)
	at org.junit.runners.ParentRunner.runLeaf(ParentRunner.java:271)
	at org.junit.runners.BlockJUnit4ClassRunner.runChild(BlockJUnit4ClassRunner.java:70)
	at org.junit.runners.BlockJUnit4ClassRunner.runChild(BlockJUnit4ClassRunner.java:50)
	at org.junit.runners.ParentRunner$3.run(ParentRunner.java:238)
	at org.junit.runners.ParentRunner$1.schedule(ParentRunner.java:63)
	at org.junit.runners.ParentRunner.runChildren(ParentRunner.java:236)
	at org.junit.runners.ParentRunner.access$000(ParentRunner.java:53)
	at org.junit.runners.ParentRunner$2.evaluate(ParentRunner.java:229)
	at org.junit.runners.ParentRunner.run(ParentRunner.java:309)
	at org.apache.maven.surefire.junit4.JUnit4Provider.execute(JUnit4Provider.java:264)
	at org.apache.maven.surefire.junit4.JUnit4Provider.executeTestSet(JUnit4Provider.java:153)
	at org.apache.maven.surefire.junit4.JUnit4Provider.invoke(JUnit4Provider.java:124)
	at org.apache.maven.surefire.booter.ForkedBooter.invokeProviderInSameClassLoader(ForkedBooter.java:200)
	at org.apache.maven.surefire.booter.ForkedBooter.runSuitesInProcess(ForkedBooter.java:153)
	at org.apache.maven.surefire.booter.ForkedBooter.main(ForkedBooter.java:103)


Tests run: 1, Failures: 1, Errors: 0, Skipped: 0
{code}




--
This message was sent by Atlassian JIRA
(v6.4.14#64029)

---------------------------------------------------------------------
To unsubscribe, e-mail: hdfs-dev-unsubscribe@hadoop.apache.org
For additional commands, e-mail: hdfs-dev-help@hadoop.apache.org


Mime
View raw message