hadoop-hdfs-dev mailing list archives

Site index · List index
Message view « Date » · « Thread »
Top « Date » · « Thread »
From Apache Jenkins Server <jenk...@builds.apache.org>
Subject Build failed in Jenkins: Hadoop-Hdfs-trunk-Java8 #1293
Date Wed, 01 Jun 2016 21:56:39 GMT
See <https://builds.apache.org/job/Hadoop-Hdfs-trunk-Java8/1293/changes>

Changes:

[wang] HADOOP-13228. Add delegation token to the connection in

------------------------------------------
[...truncated 5251 lines...]
Running org.apache.hadoop.hdfs.TestWriteBlockGetsBlockLengthHint
Tests run: 1, Failures: 0, Errors: 0, Skipped: 0, Time elapsed: 4.943 sec - in org.apache.hadoop.hdfs.TestWriteBlockGetsBlockLengthHint
Running org.apache.hadoop.hdfs.TestDFSStripedOutputStreamWithFailure130
Tests run: 26, Failures: 0, Errors: 0, Skipped: 0, Time elapsed: 76.841 sec - in org.apache.hadoop.hdfs.TestEncryptionZones
Running org.apache.hadoop.hdfs.TestDFSUpgrade
Tests run: 8, Failures: 0, Errors: 0, Skipped: 0, Time elapsed: 64.34 sec - in org.apache.hadoop.hdfs.TestClientProtocolForPipelineRecovery
Running org.apache.hadoop.hdfs.TestSnapshotCommands
Tests run: 6, Failures: 0, Errors: 0, Skipped: 0, Time elapsed: 9.23 sec - in org.apache.hadoop.hdfs.TestSnapshotCommands
Running org.apache.hadoop.hdfs.TestDataTransferProtocol
Tests run: 4, Failures: 0, Errors: 0, Skipped: 0, Time elapsed: 8.75 sec - in org.apache.hadoop.hdfs.TestDataTransferProtocol
Tests run: 2, Failures: 0, Errors: 0, Skipped: 0, Time elapsed: 22.502 sec - in org.apache.hadoop.hdfs.TestDFSUpgrade
Running org.apache.hadoop.hdfs.TestDFSStripedOutputStreamWithFailure200
Tests run: 10, Failures: 0, Errors: 0, Skipped: 0, Time elapsed: 0.374 sec - in org.apache.hadoop.hdfs.TestDFSStripedOutputStreamWithFailure200
Running org.apache.hadoop.hdfs.TestFileCreation
Running org.apache.hadoop.hdfs.TestDFSInotifyEventInputStream
Tests run: 10, Failures: 0, Errors: 0, Skipped: 0, Time elapsed: 53.558 sec - in org.apache.hadoop.hdfs.TestDFSStripedOutputStreamWithFailure130
Running org.apache.hadoop.hdfs.TestDFSUpgradeFromImage
Tests run: 5, Failures: 0, Errors: 0, Skipped: 0, Time elapsed: 22.848 sec - in org.apache.hadoop.hdfs.TestDFSInotifyEventInputStream
Running org.apache.hadoop.hdfs.TestEncryptionZonesWithKMS
Tests run: 8, Failures: 0, Errors: 0, Skipped: 0, Time elapsed: 18.767 sec - in org.apache.hadoop.hdfs.TestDFSUpgradeFromImage
Running org.apache.hadoop.hdfs.TestDecommission
Tests run: 44, Failures: 0, Errors: 0, Skipped: 0, Time elapsed: 167.377 sec - in org.apache.hadoop.hdfs.TestHDFSFileSystemContract
Running org.apache.hadoop.hdfs.TestDFSUtil
Tests run: 31, Failures: 0, Errors: 0, Skipped: 0, Time elapsed: 3.192 sec - in org.apache.hadoop.hdfs.TestDFSUtil
Running org.apache.hadoop.hdfs.TestGetBlocks
Tests run: 23, Failures: 0, Errors: 0, Skipped: 0, Time elapsed: 105.672 sec - in org.apache.hadoop.hdfs.TestFileCreation
Running org.apache.hadoop.hdfs.TestDFSStripedOutputStreamWithFailure060
Tests run: 10, Failures: 0, Errors: 0, Skipped: 0, Time elapsed: 0.375 sec - in org.apache.hadoop.hdfs.TestDFSStripedOutputStreamWithFailure060
Running org.apache.hadoop.hdfs.TestMultiThreadedHflush
Tests run: 3, Failures: 0, Errors: 0, Skipped: 0, Time elapsed: 52.569 sec - in org.apache.hadoop.hdfs.TestGetBlocks
Running org.apache.hadoop.hdfs.util.TestCyclicIteration
Tests run: 1, Failures: 0, Errors: 0, Skipped: 0, Time elapsed: 0.077 sec - in org.apache.hadoop.hdfs.util.TestCyclicIteration
Running org.apache.hadoop.hdfs.util.TestBestEffortLongFile
Tests run: 2, Failures: 0, Errors: 0, Skipped: 0, Time elapsed: 0.266 sec - in org.apache.hadoop.hdfs.util.TestBestEffortLongFile
Running org.apache.hadoop.hdfs.util.TestDiff
Tests run: 1, Failures: 0, Errors: 0, Skipped: 0, Time elapsed: 2.591 sec - in org.apache.hadoop.hdfs.util.TestDiff
Running org.apache.hadoop.hdfs.util.TestStripedBlockUtil
Tests run: 3, Failures: 0, Errors: 0, Skipped: 0, Time elapsed: 3.225 sec - in org.apache.hadoop.hdfs.util.TestStripedBlockUtil
Running org.apache.hadoop.hdfs.util.TestCombinedHostsFileReader
Tests run: 2, Failures: 0, Errors: 0, Skipped: 0, Time elapsed: 0.329 sec - in org.apache.hadoop.hdfs.util.TestCombinedHostsFileReader
Running org.apache.hadoop.hdfs.util.TestXMLUtils
Tests run: 6, Failures: 0, Errors: 0, Skipped: 0, Time elapsed: 0.078 sec - in org.apache.hadoop.hdfs.util.TestXMLUtils
Running org.apache.hadoop.hdfs.util.TestLightWeightHashSet
Tests run: 14, Failures: 0, Errors: 0, Skipped: 0, Time elapsed: 0.229 sec - in org.apache.hadoop.hdfs.util.TestLightWeightHashSet
Running org.apache.hadoop.hdfs.util.TestMD5FileUtils
Tests run: 5, Failures: 0, Errors: 0, Skipped: 0, Time elapsed: 0.452 sec - in org.apache.hadoop.hdfs.util.TestMD5FileUtils
Running org.apache.hadoop.hdfs.util.TestLightWeightLinkedSet
Tests run: 17, Failures: 0, Errors: 0, Skipped: 0, Time elapsed: 0.212 sec - in org.apache.hadoop.hdfs.util.TestLightWeightLinkedSet
Running org.apache.hadoop.hdfs.util.TestAtomicFileOutputStream
Tests run: 3, Failures: 0, Errors: 0, Skipped: 0, Time elapsed: 12.016 sec - in org.apache.hadoop.hdfs.TestMultiThreadedHflush
Tests run: 4, Failures: 0, Errors: 0, Skipped: 1, Time elapsed: 0.394 sec - in org.apache.hadoop.hdfs.util.TestAtomicFileOutputStream
Running org.apache.hadoop.hdfs.TestLease
Running org.apache.hadoop.hdfs.TestInjectionForSimulatedStorage
Tests run: 28, Failures: 0, Errors: 0, Skipped: 0, Time elapsed: 105.997 sec - in org.apache.hadoop.hdfs.TestEncryptionZonesWithKMS
Running org.apache.hadoop.hdfs.TestHFlush
Tests run: 5, Failures: 0, Errors: 0, Skipped: 0, Time elapsed: 12.765 sec - in org.apache.hadoop.hdfs.TestLease
Running org.apache.hadoop.hdfs.TestErasureCodingPolicies
Tests run: 1, Failures: 0, Errors: 0, Skipped: 0, Time elapsed: 16.405 sec - in org.apache.hadoop.hdfs.TestInjectionForSimulatedStorage
Running org.apache.hadoop.hdfs.TestHDFSPolicyProvider
Tests run: 3, Failures: 0, Errors: 0, Skipped: 0, Time elapsed: 0.281 sec - in org.apache.hadoop.hdfs.TestHDFSPolicyProvider
Running org.apache.hadoop.hdfs.TestHdfsAdmin
Tests run: 2, Failures: 0, Errors: 0, Skipped: 0, Time elapsed: 5.404 sec - in org.apache.hadoop.hdfs.TestHdfsAdmin
Running org.apache.hadoop.hdfs.TestDistributedFileSystem
Tests run: 10, Failures: 0, Errors: 0, Skipped: 0, Time elapsed: 20.744 sec - in org.apache.hadoop.hdfs.TestErasureCodingPolicies
Running org.apache.hadoop.hdfs.TestRollingUpgradeRollback
Tests run: 3, Failures: 0, Errors: 0, Skipped: 0, Time elapsed: 14.707 sec - in org.apache.hadoop.hdfs.TestRollingUpgradeRollback
Running org.apache.hadoop.hdfs.TestRollingUpgrade
Tests run: 14, Failures: 0, Errors: 0, Skipped: 0, Time elapsed: 46.488 sec - in org.apache.hadoop.hdfs.TestHFlush
Running org.apache.hadoop.hdfs.TestDatanodeDeath
Tests run: 19, Failures: 0, Errors: 0, Skipped: 1, Time elapsed: 179.616 sec - in org.apache.hadoop.hdfs.TestDecommission
Running org.apache.hadoop.hdfs.TestCrcCorruption
Tests run: 24, Failures: 0, Errors: 0, Skipped: 0, Time elapsed: 73.693 sec - in org.apache.hadoop.hdfs.TestDistributedFileSystem
Running org.apache.hadoop.hdfs.TestFsShellPermission
Tests run: 1, Failures: 0, Errors: 0, Skipped: 0, Time elapsed: 6.581 sec - in org.apache.hadoop.hdfs.TestFsShellPermission
Running org.apache.hadoop.hdfs.protocol.TestLocatedBlock
Tests run: 1, Failures: 0, Errors: 0, Skipped: 0, Time elapsed: 0.237 sec - in org.apache.hadoop.hdfs.protocol.TestLocatedBlock
Running org.apache.hadoop.hdfs.protocol.TestLayoutVersion
Tests run: 11, Failures: 0, Errors: 0, Skipped: 0, Time elapsed: 0.243 sec - in org.apache.hadoop.hdfs.protocol.TestLayoutVersion
Running org.apache.hadoop.hdfs.protocol.datatransfer.sasl.TestSaslDataTransfer
Tests run: 4, Failures: 0, Errors: 0, Skipped: 0, Time elapsed: 21.71 sec - in org.apache.hadoop.hdfs.TestCrcCorruption
Running org.apache.hadoop.hdfs.protocol.datatransfer.TestPacketReceiver
Tests run: 1, Failures: 0, Errors: 0, Skipped: 0, Time elapsed: 0.428 sec - in org.apache.hadoop.hdfs.protocol.datatransfer.TestPacketReceiver
Running org.apache.hadoop.hdfs.protocol.TestAnnotations
Tests run: 1, Failures: 0, Errors: 0, Skipped: 0, Time elapsed: 0.141 sec - in org.apache.hadoop.hdfs.protocol.TestAnnotations
Running org.apache.hadoop.hdfs.protocol.TestBlockListAsLongs
Tests run: 7, Failures: 0, Errors: 0, Skipped: 0, Time elapsed: 1.002 sec - in org.apache.hadoop.hdfs.protocol.TestBlockListAsLongs
Running org.apache.hadoop.hdfs.TestDFSStripedOutputStreamWithFailure170
Tests run: 4, Failures: 0, Errors: 0, Skipped: 0, Time elapsed: 62.107 sec - in org.apache.hadoop.hdfs.TestDatanodeDeath
Running org.apache.hadoop.hdfs.TestDFSStripedOutputStreamWithFailure190
Tests run: 9, Failures: 0, Errors: 0, Skipped: 0, Time elapsed: 22.744 sec - in org.apache.hadoop.hdfs.protocol.datatransfer.sasl.TestSaslDataTransfer
Running org.apache.hadoop.hdfs.TestDFSAddressConfig
Tests run: 1, Failures: 0, Errors: 0, Skipped: 0, Time elapsed: 7.095 sec - in org.apache.hadoop.hdfs.TestDFSAddressConfig
Running org.apache.hadoop.hdfs.TestDFSConfigKeys
Tests run: 1, Failures: 0, Errors: 0, Skipped: 0, Time elapsed: 0.261 sec - in org.apache.hadoop.hdfs.TestDFSConfigKeys
Running org.apache.hadoop.hdfs.TestParallelUnixDomainRead
Tests run: 10, Failures: 0, Errors: 0, Skipped: 0, Time elapsed: 56.77 sec - in org.apache.hadoop.hdfs.TestDFSStripedOutputStreamWithFailure170
Running org.apache.hadoop.hdfs.TestDFSStripedOutputStreamWithFailure140
Tests run: 10, Failures: 0, Errors: 0, Skipped: 0, Time elapsed: 0.455 sec - in org.apache.hadoop.hdfs.TestDFSStripedOutputStreamWithFailure140
Running org.apache.hadoop.hdfs.TestDFSStripedOutputStreamWithFailure100
Tests run: 10, Failures: 0, Errors: 0, Skipped: 0, Time elapsed: 0.441 sec - in org.apache.hadoop.hdfs.TestDFSStripedOutputStreamWithFailure100
Running org.apache.hadoop.hdfs.TestReplication
Tests run: 4, Failures: 0, Errors: 0, Skipped: 0, Time elapsed: 38.08 sec - in org.apache.hadoop.hdfs.TestParallelUnixDomainRead
Running org.apache.hadoop.hdfs.TestAsyncDFS
Tests run: 10, Failures: 0, Errors: 0, Skipped: 0, Time elapsed: 58.295 sec - in org.apache.hadoop.hdfs.TestDFSStripedOutputStreamWithFailure190
Running org.apache.hadoop.hdfs.TestFileChecksum
Tests run: 12, Failures: 0, Errors: 0, Skipped: 0, Time elapsed: 131.078 sec - in org.apache.hadoop.hdfs.TestRollingUpgrade
Running org.apache.hadoop.hdfs.TestRead
Tests run: 4, Failures: 0, Errors: 0, Skipped: 0, Time elapsed: 10.876 sec - in org.apache.hadoop.hdfs.TestAsyncDFS
Running org.apache.hadoop.hdfs.TestPipelines
Tests run: 3, Failures: 0, Errors: 0, Skipped: 0, Time elapsed: 10.894 sec - in org.apache.hadoop.hdfs.TestRead
Running org.apache.hadoop.hdfs.TestDFSStripedOutputStreamWithFailure
Tests run: 1, Failures: 0, Errors: 0, Skipped: 0, Time elapsed: 8.333 sec - in org.apache.hadoop.hdfs.TestPipelines
Running org.apache.hadoop.hdfs.TestDeprecatedKeys
Tests run: 1, Failures: 0, Errors: 0, Skipped: 0, Time elapsed: 0.561 sec - in org.apache.hadoop.hdfs.TestDeprecatedKeys
Running org.apache.hadoop.hdfs.TestAclsEndToEnd
Tests run: 9, Failures: 0, Errors: 0, Skipped: 0, Time elapsed: 61.193 sec - in org.apache.hadoop.hdfs.TestReplication
Running org.apache.hadoop.hdfs.TestParallelShortCircuitReadNoChecksum
Tests run: 4, Failures: 0, Errors: 0, Skipped: 0, Time elapsed: 17.454 sec - in org.apache.hadoop.hdfs.TestParallelShortCircuitReadNoChecksum
Running org.apache.hadoop.hdfs.TestParallelShortCircuitRead
Tests run: 10, Failures: 0, Errors: 0, Skipped: 0, Time elapsed: 70.436 sec - in org.apache.hadoop.hdfs.TestFileChecksum
Running org.apache.hadoop.hdfs.TestHDFSTrash
Tests run: 2, Failures: 0, Errors: 0, Skipped: 0, Time elapsed: 8.801 sec - in org.apache.hadoop.hdfs.TestHDFSTrash
Running org.apache.hadoop.hdfs.TestFileAppend
Tests run: 4, Failures: 0, Errors: 0, Skipped: 0, Time elapsed: 17.088 sec - in org.apache.hadoop.hdfs.TestParallelShortCircuitRead
Running org.apache.hadoop.hdfs.TestDFSRemove
Tests run: 1, Failures: 0, Errors: 0, Skipped: 0, Time elapsed: 21.861 sec - in org.apache.hadoop.hdfs.TestDFSRemove
Running org.apache.hadoop.hdfs.TestErasureCodingPolicyWithSnapshot
Tests run: 9, Failures: 0, Errors: 0, Skipped: 0, Time elapsed: 103.065 sec - in org.apache.hadoop.hdfs.TestAclsEndToEnd
Running org.apache.hadoop.hdfs.TestDFSRollback
Tests run: 12, Failures: 0, Errors: 0, Skipped: 0, Time elapsed: 49.857 sec - in org.apache.hadoop.hdfs.TestFileAppend
Running org.apache.hadoop.hdfs.TestReadWhileWriting
Tests run: 4, Failures: 0, Errors: 0, Skipped: 0, Time elapsed: 27.276 sec - in org.apache.hadoop.hdfs.TestErasureCodingPolicyWithSnapshot
Running org.apache.hadoop.hdfs.TestConnCache
Tests run: 1, Failures: 0, Errors: 0, Skipped: 0, Time elapsed: 8.34 sec - in org.apache.hadoop.hdfs.TestReadWhileWriting
Tests run: 4, Failures: 0, Errors: 0, Skipped: 0, Time elapsed: 125.912 sec - in org.apache.hadoop.hdfs.TestDFSStripedOutputStreamWithFailure
Running org.apache.hadoop.hdfs.TestPersistBlocks
Running org.apache.hadoop.hdfs.TestSetrepDecreasing
Tests run: 1, Failures: 0, Errors: 0, Skipped: 0, Time elapsed: 5.263 sec - in org.apache.hadoop.hdfs.TestConnCache
Running org.apache.hadoop.hdfs.TestDatanodeLayoutUpgrade
Tests run: 1, Failures: 0, Errors: 0, Skipped: 0, Time elapsed: 21.948 sec - in org.apache.hadoop.hdfs.TestDFSRollback
Running org.apache.hadoop.hdfs.TestFileCorruption
Tests run: 2, Failures: 0, Errors: 0, Skipped: 0, Time elapsed: 8.198 sec - in org.apache.hadoop.hdfs.TestDatanodeLayoutUpgrade
Running org.apache.hadoop.hdfs.TestDFSStartupVersions
Tests run: 4, Failures: 0, Errors: 0, Skipped: 0, Time elapsed: 13.829 sec - in org.apache.hadoop.hdfs.TestFileCorruption
Tests run: 1, Failures: 0, Errors: 0, Skipped: 0, Time elapsed: 18.538 sec - in org.apache.hadoop.hdfs.TestSetrepDecreasing
Running org.apache.hadoop.hdfs.TestWriteConfigurationToDFS
Running org.apache.hadoop.hdfs.TestListFilesInDFS
Tests run: 2, Failures: 0, Errors: 0, Skipped: 0, Time elapsed: 6.741 sec - in org.apache.hadoop.hdfs.TestListFilesInDFS
Tests run: 1, Failures: 0, Errors: 0, Skipped: 0, Time elapsed: 7.18 sec - in org.apache.hadoop.hdfs.TestWriteConfigurationToDFS
Tests run: 5, Failures: 0, Errors: 0, Skipped: 0, Time elapsed: 27.588 sec - in org.apache.hadoop.hdfs.TestPersistBlocks
Tests run: 1, Failures: 0, Errors: 0, Skipped: 0, Time elapsed: 16.147 sec - in org.apache.hadoop.hdfs.TestDFSStartupVersions

Results :

Tests in error: 
  TestDataNodeHotSwapVolumes.testRemoveVolumeBeingWritten ยป IO Failed to replace...

Tests run: 4435, Failures: 0, Errors: 1, Skipped: 17

[INFO]                                                                         
[INFO] ------------------------------------------------------------------------
[INFO] Skipping Apache Hadoop HDFS Native Client
[INFO] This project has been banned from the build due to previous failures.
[INFO] ------------------------------------------------------------------------
[INFO]                                                                         
[INFO] ------------------------------------------------------------------------
[INFO] Skipping Apache Hadoop HttpFS
[INFO] This project has been banned from the build due to previous failures.
[INFO] ------------------------------------------------------------------------
[INFO]                                                                         
[INFO] ------------------------------------------------------------------------
[INFO] Skipping Apache Hadoop HDFS BookKeeper Journal
[INFO] This project has been banned from the build due to previous failures.
[INFO] ------------------------------------------------------------------------
[INFO]                                                                         
[INFO] ------------------------------------------------------------------------
[INFO] Skipping Apache Hadoop HDFS-NFS
[INFO] This project has been banned from the build due to previous failures.
[INFO] ------------------------------------------------------------------------
[INFO]                                                                         
[INFO] ------------------------------------------------------------------------
[INFO] Building Apache Hadoop HDFS Project 3.0.0-alpha1-SNAPSHOT
[INFO] ------------------------------------------------------------------------
[INFO] 
[INFO] --- maven-clean-plugin:2.5:clean (default-clean) @ hadoop-hdfs-project ---
[INFO] Deleting <https://builds.apache.org/job/Hadoop-Hdfs-trunk-Java8/ws/source/hadoop-hdfs-project/target>
[INFO] 
[INFO] --- maven-antrun-plugin:1.7:run (create-testdirs) @ hadoop-hdfs-project ---
[INFO] Executing tasks

main:
    [mkdir] Created dir: <https://builds.apache.org/job/Hadoop-Hdfs-trunk-Java8/ws/source/hadoop-hdfs-project/target/test-dir>
[INFO] Executed tasks
[INFO] 
[INFO] --- maven-source-plugin:2.3:jar-no-fork (hadoop-java-sources) @ hadoop-hdfs-project
---
[INFO] 
[INFO] --- maven-source-plugin:2.3:test-jar-no-fork (hadoop-java-sources) @ hadoop-hdfs-project
---
[INFO] 
[INFO] --- maven-enforcer-plugin:1.3.1:enforce (dist-enforce) @ hadoop-hdfs-project ---
[INFO] 
[INFO] --- maven-site-plugin:3.5:attach-descriptor (attach-descriptor) @ hadoop-hdfs-project
---
[INFO] 
[INFO] --- maven-javadoc-plugin:2.8.1:jar (module-javadocs) @ hadoop-hdfs-project ---
[INFO] Not executing Javadoc as the project is not a Java classpath-capable package
[INFO] 
[INFO] --- maven-enforcer-plugin:1.3.1:enforce (depcheck) @ hadoop-hdfs-project ---
[INFO] 
[INFO] --- maven-checkstyle-plugin:2.15:checkstyle (default-cli) @ hadoop-hdfs-project ---
[INFO] 
[INFO] --- findbugs-maven-plugin:3.0.0:findbugs (default-cli) @ hadoop-hdfs-project ---
[INFO] ------------------------------------------------------------------------
[INFO] Reactor Summary:
[INFO] 
[INFO] Apache Hadoop HDFS Client .......................... SUCCESS [04:06 min]
[INFO] Apache Hadoop HDFS ................................. FAILURE [  01:06 h]
[INFO] Apache Hadoop HDFS Native Client ................... SKIPPED
[INFO] Apache Hadoop HttpFS ............................... SKIPPED
[INFO] Apache Hadoop HDFS BookKeeper Journal .............. SKIPPED
[INFO] Apache Hadoop HDFS-NFS ............................. SKIPPED
[INFO] Apache Hadoop HDFS Project ......................... SUCCESS [  0.102 s]
[INFO] ------------------------------------------------------------------------
[INFO] BUILD FAILURE
[INFO] ------------------------------------------------------------------------
[INFO] Total time: 01:10 h
[INFO] Finished at: 2016-06-01T21:56:25+00:00
[INFO] Final Memory: 92M/3645M
[INFO] ------------------------------------------------------------------------
[ERROR] Failed to execute goal org.apache.maven.plugins:maven-surefire-plugin:2.17:test (default-test)
on project hadoop-hdfs: There are test failures.
[ERROR] 
[ERROR] Please refer to <https://builds.apache.org/job/Hadoop-Hdfs-trunk-Java8/ws/source/hadoop-hdfs-project/hadoop-hdfs/target/surefire-reports>
for the individual test results.
[ERROR] -> [Help 1]
[ERROR] 
[ERROR] To see the full stack trace of the errors, re-run Maven with the -e switch.
[ERROR] Re-run Maven using the -X switch to enable full debug logging.
[ERROR] 
[ERROR] For more information about the errors and possible solutions, please read the following
articles:
[ERROR] [Help 1] http://cwiki.apache.org/confluence/display/MAVEN/MojoFailureException
[ERROR] 
[ERROR] After correcting the problems, you can resume the build with the command
[ERROR]   mvn <goals> -rf :hadoop-hdfs
Build step 'Execute shell' marked build as failure
Archiving artifacts
Setting LATEST1_8_HOME=/home/jenkins/jenkins-slave/tools/hudson.model.JDK/latest1.8
Setting MAVEN_3_3_3_HOME=/home/jenkins/jenkins-slave/tools/hudson.tasks.Maven_MavenInstallation/maven-3.3.3
Recording test results
Setting LATEST1_8_HOME=/home/jenkins/jenkins-slave/tools/hudson.model.JDK/latest1.8
Setting MAVEN_3_3_3_HOME=/home/jenkins/jenkins-slave/tools/hudson.tasks.Maven_MavenInstallation/maven-3.3.3
Setting LATEST1_8_HOME=/home/jenkins/jenkins-slave/tools/hudson.model.JDK/latest1.8
Setting MAVEN_3_3_3_HOME=/home/jenkins/jenkins-slave/tools/hudson.tasks.Maven_MavenInstallation/maven-3.3.3

---------------------------------------------------------------------
To unsubscribe, e-mail: hdfs-dev-unsubscribe@hadoop.apache.org
For additional commands, e-mail: hdfs-dev-help@hadoop.apache.org


Mime
View raw message