hadoop-hdfs-dev mailing list archives

Site index · List index
Message view « Date » · « Thread »
Top « Date » · « Thread »
From Apache Jenkins Server <jenk...@builds.apache.org>
Subject Build failed in Jenkins: Hadoop-Hdfs-trunk-Java8 #1328
Date Thu, 09 Jun 2016 22:14:16 GMT
See <https://builds.apache.org/job/Hadoop-Hdfs-trunk-Java8/1328/changes>

Changes:

[stevel] HADOOP-12537 S3A to support Amazon STS temporary credentials.

[wang] HADOOP-13175. Remove hadoop-ant from hadoop-tools. Contributed by Chris

[wang] HADOOP-12893. Verify LICENSE.txt and NOTICE.txt. Contributed by Xiao

------------------------------------------
[...truncated 6182 lines...]
Running org.apache.hadoop.hdfs.TestWriteRead
Tests run: 3, Failures: 0, Errors: 0, Skipped: 0, Time elapsed: 21.992 sec - in org.apache.hadoop.hdfs.TestWriteRead
Running org.apache.hadoop.hdfs.TestDFSInotifyEventInputStream
Tests run: 5, Failures: 0, Errors: 0, Skipped: 0, Time elapsed: 18.672 sec - in org.apache.hadoop.hdfs.TestDFSInotifyEventInputStream
Running org.apache.hadoop.hdfs.TestClientProtocolForPipelineRecovery
Tests run: 26, Failures: 0, Errors: 0, Skipped: 0, Time elapsed: 108.68 sec - in org.apache.hadoop.hdfs.TestEncryptedTransfer
Running org.apache.hadoop.hdfs.TestReplaceDatanodeOnFailure
Tests run: 4, Failures: 0, Errors: 0, Skipped: 0, Time elapsed: 11.089 sec - in org.apache.hadoop.hdfs.TestReplaceDatanodeOnFailure
Running org.apache.hadoop.hdfs.TestPersistBlocks
Tests run: 6, Failures: 0, Errors: 0, Skipped: 0, Time elapsed: 185.535 sec - in org.apache.hadoop.hdfs.server.mover.TestStorageMover
Running org.apache.hadoop.hdfs.TestFSInputChecker
Tests run: 1, Failures: 0, Errors: 0, Skipped: 0, Time elapsed: 4.973 sec - in org.apache.hadoop.hdfs.TestFSInputChecker
Running org.apache.hadoop.hdfs.TestDFSStripedOutputStreamWithFailure170
Tests run: 5, Failures: 0, Errors: 0, Skipped: 0, Time elapsed: 23.079 sec - in org.apache.hadoop.hdfs.TestPersistBlocks
Running org.apache.hadoop.fs.TestFcHdfsSetUMask
Tests run: 12, Failures: 0, Errors: 0, Skipped: 0, Time elapsed: 5.197 sec - in org.apache.hadoop.fs.TestFcHdfsSetUMask
Running org.apache.hadoop.fs.TestFcHdfsPermission
Tests run: 4, Failures: 0, Errors: 0, Skipped: 0, Time elapsed: 5.342 sec - in org.apache.hadoop.fs.TestFcHdfsPermission
Tests run: 8, Failures: 0, Errors: 0, Skipped: 0, Time elapsed: 53.438 sec - in org.apache.hadoop.hdfs.TestClientProtocolForPipelineRecovery
Running org.apache.hadoop.fs.TestGlobPaths
Running org.apache.hadoop.fs.loadGenerator.TestLoadGenerator
Tests run: 37, Failures: 0, Errors: 0, Skipped: 6, Time elapsed: 5.711 sec - in org.apache.hadoop.fs.TestGlobPaths
Running org.apache.hadoop.fs.TestSymlinkHdfsDisable
Tests run: 1, Failures: 0, Errors: 0, Skipped: 0, Time elapsed: 5.057 sec - in org.apache.hadoop.fs.TestSymlinkHdfsDisable
Running org.apache.hadoop.fs.TestSymlinkHdfsFileSystem
Tests run: 2, Failures: 0, Errors: 0, Skipped: 0, Time elapsed: 15.847 sec - in org.apache.hadoop.fs.loadGenerator.TestLoadGenerator
Running org.apache.hadoop.fs.TestUrlStreamHandler
Tests run: 10, Failures: 0, Errors: 0, Skipped: 0, Time elapsed: 44.003 sec - in org.apache.hadoop.hdfs.TestDFSStripedOutputStreamWithFailure170
Running org.apache.hadoop.fs.TestUnbuffer
Tests run: 2, Failures: 0, Errors: 0, Skipped: 0, Time elapsed: 5.783 sec - in org.apache.hadoop.fs.TestUrlStreamHandler
Running org.apache.hadoop.fs.TestFcHdfsCreateMkdir
Tests run: 2, Failures: 0, Errors: 0, Skipped: 0, Time elapsed: 8.144 sec - in org.apache.hadoop.fs.TestUnbuffer
Running org.apache.hadoop.fs.TestEnhancedByteBufferAccess
Tests run: 74, Failures: 0, Errors: 0, Skipped: 2, Time elapsed: 16.094 sec - in org.apache.hadoop.fs.TestSymlinkHdfsFileSystem
Tests run: 11, Failures: 0, Errors: 0, Skipped: 0, Time elapsed: 5.486 sec - in org.apache.hadoop.fs.TestFcHdfsCreateMkdir
Running org.apache.hadoop.fs.TestHdfsNativeCodeLoader
Tests run: 1, Failures: 0, Errors: 0, Skipped: 0, Time elapsed: 0.18 sec - in org.apache.hadoop.fs.TestHdfsNativeCodeLoader
Running org.apache.hadoop.fs.TestHDFSFileContextMainOperations
Running org.apache.hadoop.fs.shell.TestHdfsTextCommand
Tests run: 1, Failures: 0, Errors: 0, Skipped: 0, Time elapsed: 5.635 sec - in org.apache.hadoop.fs.shell.TestHdfsTextCommand
Running org.apache.hadoop.fs.TestSWebHdfsFileContextMainOperations
Tests run: 69, Failures: 0, Errors: 0, Skipped: 0, Time elapsed: 15.428 sec - in org.apache.hadoop.fs.TestHDFSFileContextMainOperations
Tests run: 10, Failures: 0, Errors: 0, Skipped: 1, Time elapsed: 17.111 sec - in org.apache.hadoop.fs.TestEnhancedByteBufferAccess
Running org.apache.hadoop.fs.TestResolveHdfsSymlink
Running org.apache.hadoop.fs.TestWebHdfsFileContextMainOperations
Tests run: 4, Failures: 0, Errors: 0, Skipped: 0, Time elapsed: 5.266 sec - in org.apache.hadoop.fs.TestResolveHdfsSymlink
Running org.apache.hadoop.fs.viewfs.TestViewFsWithAcls
Tests run: 61, Failures: 0, Errors: 0, Skipped: 0, Time elapsed: 16.583 sec - in org.apache.hadoop.fs.TestSWebHdfsFileContextMainOperations
Running org.apache.hadoop.fs.viewfs.TestViewFsFileStatusHdfs
Tests run: 1, Failures: 0, Errors: 0, Skipped: 0, Time elapsed: 6.632 sec - in org.apache.hadoop.fs.viewfs.TestViewFsWithAcls
Running org.apache.hadoop.fs.viewfs.TestViewFileSystemHdfs
Tests run: 2, Failures: 0, Errors: 0, Skipped: 0, Time elapsed: 6.481 sec - in org.apache.hadoop.fs.viewfs.TestViewFsFileStatusHdfs
Tests run: 61, Failures: 0, Errors: 0, Skipped: 0, Time elapsed: 13.884 sec - in org.apache.hadoop.fs.TestWebHdfsFileContextMainOperations
Running org.apache.hadoop.fs.viewfs.TestViewFsWithXAttrs
Running org.apache.hadoop.fs.viewfs.TestViewFsAtHdfsRoot
Tests run: 32, Failures: 0, Errors: 0, Skipped: 0, Time elapsed: 305.244 sec - in org.apache.hadoop.hdfs.server.balancer.TestBalancer
Running org.apache.hadoop.fs.viewfs.TestViewFsHdfs
Tests run: 1, Failures: 0, Errors: 0, Skipped: 0, Time elapsed: 7.039 sec - in org.apache.hadoop.fs.viewfs.TestViewFsWithXAttrs
Running org.apache.hadoop.fs.viewfs.TestViewFileSystemWithAcls
Tests run: 1, Failures: 0, Errors: 0, Skipped: 0, Time elapsed: 8.094 sec - in org.apache.hadoop.fs.viewfs.TestViewFileSystemWithAcls
Tests run: 58, Failures: 0, Errors: 0, Skipped: 0, Time elapsed: 16.183 sec - in org.apache.hadoop.fs.viewfs.TestViewFsAtHdfsRoot
Running org.apache.hadoop.fs.viewfs.TestViewFileSystemAtHdfsRoot
Running org.apache.hadoop.fs.viewfs.TestViewFileSystemWithXAttrs
Tests run: 58, Failures: 0, Errors: 0, Skipped: 0, Time elapsed: 16.299 sec - in org.apache.hadoop.fs.viewfs.TestViewFsHdfs
Running org.apache.hadoop.fs.viewfs.TestViewFsDefaultValue
Tests run: 60, Failures: 0, Errors: 0, Skipped: 0, Time elapsed: 25.827 sec - in org.apache.hadoop.fs.viewfs.TestViewFileSystemHdfs
Running org.apache.hadoop.fs.TestSymlinkHdfsFileContext
Tests run: 1, Failures: 0, Errors: 0, Skipped: 0, Time elapsed: 7.952 sec - in org.apache.hadoop.fs.viewfs.TestViewFileSystemWithXAttrs
Running org.apache.hadoop.fs.contract.hdfs.TestHDFSContractDelete
Tests run: 7, Failures: 0, Errors: 0, Skipped: 0, Time elapsed: 6.927 sec - in org.apache.hadoop.fs.viewfs.TestViewFsDefaultValue
Running org.apache.hadoop.fs.contract.hdfs.TestHDFSContractSetTimes
Tests run: 8, Failures: 0, Errors: 0, Skipped: 0, Time elapsed: 8.632 sec - in org.apache.hadoop.fs.contract.hdfs.TestHDFSContractDelete
Running org.apache.hadoop.fs.contract.hdfs.TestHDFSContractMkdir
Tests run: 60, Failures: 0, Errors: 0, Skipped: 0, Time elapsed: 22.085 sec - in org.apache.hadoop.fs.viewfs.TestViewFileSystemAtHdfsRoot
Tests run: 1, Failures: 0, Errors: 0, Skipped: 0, Time elapsed: 8.562 sec - in org.apache.hadoop.fs.contract.hdfs.TestHDFSContractSetTimes
Running org.apache.hadoop.fs.contract.hdfs.TestHDFSContractOpen
Running org.apache.hadoop.fs.contract.hdfs.TestHDFSContractRootDirectory
Tests run: 5, Failures: 0, Errors: 0, Skipped: 0, Time elapsed: 8.667 sec - in org.apache.hadoop.fs.contract.hdfs.TestHDFSContractMkdir
Running org.apache.hadoop.fs.contract.hdfs.TestHDFSContractAppend
Tests run: 6, Failures: 0, Errors: 0, Skipped: 0, Time elapsed: 6.642 sec - in org.apache.hadoop.fs.contract.hdfs.TestHDFSContractRootDirectory
Tests run: 71, Failures: 0, Errors: 0, Skipped: 0, Time elapsed: 21.478 sec - in org.apache.hadoop.fs.TestSymlinkHdfsFileContext
Running org.apache.hadoop.fs.contract.hdfs.TestHDFSContractCreate
Tests run: 6, Failures: 0, Errors: 0, Skipped: 0, Time elapsed: 7.819 sec - in org.apache.hadoop.fs.contract.hdfs.TestHDFSContractOpen
Running org.apache.hadoop.fs.contract.hdfs.TestHDFSContractSeek
Running org.apache.hadoop.fs.contract.hdfs.TestHDFSContractRename
Tests run: 5, Failures: 0, Errors: 0, Skipped: 0, Time elapsed: 8.357 sec - in org.apache.hadoop.fs.contract.hdfs.TestHDFSContractAppend
Running org.apache.hadoop.fs.contract.hdfs.TestHDFSContractGetFileStatus
Tests run: 6, Failures: 0, Errors: 0, Skipped: 0, Time elapsed: 8.671 sec - in org.apache.hadoop.fs.contract.hdfs.TestHDFSContractCreate
Tests run: 6, Failures: 0, Errors: 0, Skipped: 0, Time elapsed: 7.912 sec - in org.apache.hadoop.fs.contract.hdfs.TestHDFSContractRename
Running org.apache.hadoop.fs.contract.hdfs.TestHDFSContractConcat
Running org.apache.hadoop.fs.permission.TestStickyBit
Tests run: 18, Failures: 0, Errors: 0, Skipped: 0, Time elapsed: 13.174 sec - in org.apache.hadoop.fs.contract.hdfs.TestHDFSContractSeek
Tests run: 2, Failures: 0, Errors: 0, Skipped: 0, Time elapsed: 6.517 sec - in org.apache.hadoop.fs.contract.hdfs.TestHDFSContractGetFileStatus
Running org.apache.hadoop.metrics2.sink.TestRollingFileSystemSinkWithHdfs
Running org.apache.hadoop.metrics2.sink.TestRollingFileSystemSinkWithSecureHdfs
Tests run: 4, Failures: 0, Errors: 0, Skipped: 0, Time elapsed: 7.32 sec - in org.apache.hadoop.fs.contract.hdfs.TestHDFSContractConcat
Running org.apache.hadoop.TestRefreshCallQueue
Tests run: 6, Failures: 0, Errors: 0, Skipped: 0, Time elapsed: 14.668 sec - in org.apache.hadoop.fs.permission.TestStickyBit
Running org.apache.hadoop.security.TestPermissionSymlinks
Tests run: 1, Failures: 0, Errors: 0, Skipped: 0, Time elapsed: 9.12 sec - in org.apache.hadoop.TestRefreshCallQueue
Running org.apache.hadoop.security.TestRefreshUserMappings
Tests run: 2, Failures: 0, Errors: 0, Skipped: 0, Time elapsed: 14.643 sec - in org.apache.hadoop.metrics2.sink.TestRollingFileSystemSinkWithSecureHdfs
Running org.apache.hadoop.security.TestPermission
Tests run: 15, Failures: 0, Errors: 0, Skipped: 0, Time elapsed: 8.707 sec - in org.apache.hadoop.security.TestPermissionSymlinks
Running org.apache.hadoop.tools.TestTools
Tests run: 2, Failures: 0, Errors: 0, Skipped: 0, Time elapsed: 8.247 sec - in org.apache.hadoop.security.TestRefreshUserMappings
Running org.apache.hadoop.tools.TestJMXGet
Tests run: 5, Failures: 0, Errors: 0, Skipped: 0, Time elapsed: 2.582 sec - in org.apache.hadoop.tools.TestTools
Running org.apache.hadoop.tools.TestHdfsConfigFields
Tests run: 3, Failures: 0, Errors: 0, Skipped: 0, Time elapsed: 0.812 sec - in org.apache.hadoop.tools.TestHdfsConfigFields
Running org.apache.hadoop.tracing.TestTracing
Tests run: 3, Failures: 0, Errors: 0, Skipped: 0, Time elapsed: 9.372 sec - in org.apache.hadoop.security.TestPermission
Running org.apache.hadoop.tracing.TestTraceAdmin
Tests run: 2, Failures: 0, Errors: 0, Skipped: 0, Time elapsed: 7.734 sec - in org.apache.hadoop.tools.TestJMXGet
Running org.apache.hadoop.tracing.TestTracingShortCircuitLocalRead
Tests run: 1, Failures: 0, Errors: 0, Skipped: 0, Time elapsed: 7.928 sec - in org.apache.hadoop.tracing.TestTracing
Running org.apache.hadoop.net.TestNetworkTopology
Tests run: 2, Failures: 0, Errors: 0, Skipped: 0, Time elapsed: 9.316 sec - in org.apache.hadoop.tracing.TestTraceAdmin
Running org.apache.hadoop.TestGenericRefresh
Tests run: 1, Failures: 0, Errors: 0, Skipped: 0, Time elapsed: 6.833 sec - in org.apache.hadoop.tracing.TestTracingShortCircuitLocalRead
Running org.apache.hadoop.cli.TestHDFSCLI
Tests run: 9, Failures: 0, Errors: 0, Skipped: 0, Time elapsed: 6.403 sec - in org.apache.hadoop.TestGenericRefresh
Running org.apache.hadoop.cli.TestCacheAdminCLI
Tests run: 12, Failures: 0, Errors: 0, Skipped: 0, Time elapsed: 11.723 sec - in org.apache.hadoop.net.TestNetworkTopology
Running org.apache.hadoop.cli.TestAclCLI
Tests run: 11, Failures: 0, Errors: 0, Skipped: 0, Time elapsed: 48.961 sec - in org.apache.hadoop.metrics2.sink.TestRollingFileSystemSinkWithHdfs
Running org.apache.hadoop.cli.TestErasureCodingCLI
Tests run: 1, Failures: 0, Errors: 0, Skipped: 0, Time elapsed: 9.863 sec - in org.apache.hadoop.cli.TestCacheAdminCLI
Tests run: 1, Failures: 0, Errors: 0, Skipped: 0, Time elapsed: 7.776 sec - in org.apache.hadoop.cli.TestAclCLI
Running org.apache.hadoop.cli.TestCryptoAdminCLI
Running org.apache.hadoop.cli.TestXAttrCLI
Tests run: 1, Failures: 0, Errors: 0, Skipped: 0, Time elapsed: 9.062 sec - in org.apache.hadoop.cli.TestErasureCodingCLI
Running org.apache.hadoop.cli.TestDeleteCLI
Tests run: 1, Failures: 0, Errors: 0, Skipped: 0, Time elapsed: 10.039 sec - in org.apache.hadoop.cli.TestCryptoAdminCLI
Tests run: 1, Failures: 0, Errors: 0, Skipped: 0, Time elapsed: 9.892 sec - in org.apache.hadoop.cli.TestXAttrCLI
Tests run: 1, Failures: 0, Errors: 0, Skipped: 0, Time elapsed: 9.736 sec - in org.apache.hadoop.cli.TestDeleteCLI
Tests run: 1, Failures: 0, Errors: 0, Skipped: 0, Time elapsed: 83.226 sec - in org.apache.hadoop.cli.TestHDFSCLI

Results :

Failed tests: 
  TestRollingUpgrade.testCheckpointWithMultipleNN:568->testCheckpoint:604 Test resulted
in an unexpected exit
  TestRollingUpgrade.testDFSAdminRollingUpgradeCommands:102->checkMxBeanIsNull:295 expected
null, but was:<javax.management.openmbean.CompositeDataSupport(compositeType=javax.management.openmbean.CompositeType(name=org.apache.hadoop.hdfs.protocol.RollingUpgradeInfo$Bean,items=((itemName=blockPoolId,itemType=javax.management.openmbean.SimpleType(name=java.lang.String)),(itemName=createdRollbackImages,itemType=javax.management.openmbean.SimpleType(name=java.lang.Boolean)),(itemName=finalizeTime,itemType=javax.management.openmbean.SimpleType(name=java.lang.Long)),(itemName=startTime,itemType=javax.management.openmbean.SimpleType(name=java.lang.Long)))),contents={blockPoolId=BP-1675260558-67.195.81.148-1465507698494,
createdRollbackImages=true, finalizeTime=0, startTime=1465507699695})>
  TestRollingUpgrade.testRollback:324->checkMxBeanIsNull:295 expected null, but was:<javax.management.openmbean.CompositeDataSupport(compositeType=javax.management.openmbean.CompositeType(name=org.apache.hadoop.hdfs.protocol.RollingUpgradeInfo$Bean,items=((itemName=blockPoolId,itemType=javax.management.openmbean.SimpleType(name=java.lang.String)),(itemName=createdRollbackImages,itemType=javax.management.openmbean.SimpleType(name=java.lang.Boolean)),(itemName=finalizeTime,itemType=javax.management.openmbean.SimpleType(name=java.lang.Long)),(itemName=startTime,itemType=javax.management.openmbean.SimpleType(name=java.lang.Long)))),contents={blockPoolId=BP-1675260558-67.195.81.148-1465507698494,
createdRollbackImages=true, finalizeTime=0, startTime=1465507699695})>
  TestDataNodeErasureCodingMetrics.testEcTasks:108 Bad value for metric EcReconstructionTasks
expected:<1> but was:<0>

Tests in error: 
  TestAsyncHDFSWithHA.testAsyncWithHAFailover:166 ยป Execution org.apache.hadoop....

Tests run: 4435, Failures: 4, Errors: 1, Skipped: 17

[INFO]                                                                         
[INFO] ------------------------------------------------------------------------
[INFO] Skipping Apache Hadoop HDFS Native Client
[INFO] This project has been banned from the build due to previous failures.
[INFO] ------------------------------------------------------------------------
[INFO]                                                                         
[INFO] ------------------------------------------------------------------------
[INFO] Skipping Apache Hadoop HttpFS
[INFO] This project has been banned from the build due to previous failures.
[INFO] ------------------------------------------------------------------------
[INFO]                                                                         
[INFO] ------------------------------------------------------------------------
[INFO] Skipping Apache Hadoop HDFS BookKeeper Journal
[INFO] This project has been banned from the build due to previous failures.
[INFO] ------------------------------------------------------------------------
[INFO]                                                                         
[INFO] ------------------------------------------------------------------------
[INFO] Skipping Apache Hadoop HDFS-NFS
[INFO] This project has been banned from the build due to previous failures.
[INFO] ------------------------------------------------------------------------
[INFO]                                                                         
[INFO] ------------------------------------------------------------------------
[INFO] Building Apache Hadoop HDFS Project 3.0.0-alpha1-SNAPSHOT
[INFO] ------------------------------------------------------------------------
[INFO] 
[INFO] --- maven-clean-plugin:2.5:clean (default-clean) @ hadoop-hdfs-project ---
[INFO] Deleting <https://builds.apache.org/job/Hadoop-Hdfs-trunk-Java8/ws/source/hadoop-hdfs-project/target>
[INFO] 
[INFO] --- maven-antrun-plugin:1.7:run (create-testdirs) @ hadoop-hdfs-project ---
[INFO] Executing tasks

main:
    [mkdir] Created dir: <https://builds.apache.org/job/Hadoop-Hdfs-trunk-Java8/ws/source/hadoop-hdfs-project/target/test-dir>
[INFO] Executed tasks
[INFO] 
[INFO] --- maven-remote-resources-plugin:1.5:process (default) @ hadoop-hdfs-project ---
[INFO] 
[INFO] --- maven-antrun-plugin:1.7:run (copy-files) @ hadoop-hdfs-project ---
[INFO] Executing tasks

main:
[INFO] Executed tasks
[INFO] 
[INFO] --- maven-source-plugin:2.3:jar-no-fork (hadoop-java-sources) @ hadoop-hdfs-project
---
[INFO] 
[INFO] --- maven-source-plugin:2.3:test-jar-no-fork (hadoop-java-sources) @ hadoop-hdfs-project
---
[INFO] 
[INFO] --- maven-enforcer-plugin:1.3.1:enforce (dist-enforce) @ hadoop-hdfs-project ---
[INFO] 
[INFO] --- maven-site-plugin:3.5:attach-descriptor (attach-descriptor) @ hadoop-hdfs-project
---
[INFO] 
[INFO] --- maven-javadoc-plugin:2.8.1:jar (module-javadocs) @ hadoop-hdfs-project ---
[INFO] Not executing Javadoc as the project is not a Java classpath-capable package
[INFO] 
[INFO] --- maven-enforcer-plugin:1.3.1:enforce (depcheck) @ hadoop-hdfs-project ---
[INFO] 
[INFO] --- maven-checkstyle-plugin:2.15:checkstyle (default-cli) @ hadoop-hdfs-project ---
[INFO] 
[INFO] --- findbugs-maven-plugin:3.0.0:findbugs (default-cli) @ hadoop-hdfs-project ---
[INFO] ------------------------------------------------------------------------
[INFO] Reactor Summary:
[INFO] 
[INFO] Apache Hadoop HDFS Client .......................... SUCCESS [04:45 min]
[INFO] Apache Hadoop HDFS ................................. FAILURE [59:46 min]
[INFO] Apache Hadoop HDFS Native Client ................... SKIPPED
[INFO] Apache Hadoop HttpFS ............................... SKIPPED
[INFO] Apache Hadoop HDFS BookKeeper Journal .............. SKIPPED
[INFO] Apache Hadoop HDFS-NFS ............................. SKIPPED
[INFO] Apache Hadoop HDFS Project ......................... SUCCESS [  0.783 s]
[INFO] ------------------------------------------------------------------------
[INFO] BUILD FAILURE
[INFO] ------------------------------------------------------------------------
[INFO] Total time: 01:04 h
[INFO] Finished at: 2016-06-09T22:14:04+00:00
[INFO] Final Memory: 97M/3979M
[INFO] ------------------------------------------------------------------------
[ERROR] Failed to execute goal org.apache.maven.plugins:maven-surefire-plugin:2.17:test (default-test)
on project hadoop-hdfs: There are test failures.
[ERROR] 
[ERROR] Please refer to <https://builds.apache.org/job/Hadoop-Hdfs-trunk-Java8/ws/source/hadoop-hdfs-project/hadoop-hdfs/target/surefire-reports>
for the individual test results.
[ERROR] -> [Help 1]
[ERROR] 
[ERROR] To see the full stack trace of the errors, re-run Maven with the -e switch.
[ERROR] Re-run Maven using the -X switch to enable full debug logging.
[ERROR] 
[ERROR] For more information about the errors and possible solutions, please read the following
articles:
[ERROR] [Help 1] http://cwiki.apache.org/confluence/display/MAVEN/MojoFailureException
[ERROR] 
[ERROR] After correcting the problems, you can resume the build with the command
[ERROR]   mvn <goals> -rf :hadoop-hdfs
Build step 'Execute shell' marked build as failure
Archiving artifacts
Setting LATEST1_8_HOME=/home/jenkins/jenkins-slave/tools/hudson.model.JDK/latest1.8
Setting MAVEN_3_3_3_HOME=/home/jenkins/jenkins-slave/tools/hudson.tasks.Maven_MavenInstallation/maven-3.3.3
Recording test results
Setting LATEST1_8_HOME=/home/jenkins/jenkins-slave/tools/hudson.model.JDK/latest1.8
Setting MAVEN_3_3_3_HOME=/home/jenkins/jenkins-slave/tools/hudson.tasks.Maven_MavenInstallation/maven-3.3.3
Setting LATEST1_8_HOME=/home/jenkins/jenkins-slave/tools/hudson.model.JDK/latest1.8
Setting MAVEN_3_3_3_HOME=/home/jenkins/jenkins-slave/tools/hudson.tasks.Maven_MavenInstallation/maven-3.3.3

---------------------------------------------------------------------
To unsubscribe, e-mail: hdfs-dev-unsubscribe@hadoop.apache.org
For additional commands, e-mail: hdfs-dev-help@hadoop.apache.org


Mime
View raw message