hadoop-hdfs-dev mailing list archives

Site index · List index
Message view « Date » · « Thread »
Top « Date » · « Thread »
From Apache Jenkins Server <jenk...@builds.apache.org>
Subject Hadoop-Hdfs-trunk-Java8 - Build # 1326 - Still Failing
Date Thu, 09 Jun 2016 19:04:32 GMT
See https://builds.apache.org/job/Hadoop-Hdfs-trunk-Java8/1326/

###################################################################################
########################## LAST 60 LINES OF THE CONSOLE ###########################
[...truncated 6158 lines...]
[INFO] 
[INFO] --- maven-enforcer-plugin:1.3.1:enforce (dist-enforce) @ hadoop-hdfs-project ---
[INFO] 
[INFO] --- maven-site-plugin:3.5:attach-descriptor (attach-descriptor) @ hadoop-hdfs-project
---
[INFO] 
[INFO] --- maven-javadoc-plugin:2.8.1:jar (module-javadocs) @ hadoop-hdfs-project ---
[INFO] Not executing Javadoc as the project is not a Java classpath-capable package
[INFO] 
[INFO] --- maven-enforcer-plugin:1.3.1:enforce (depcheck) @ hadoop-hdfs-project ---
[INFO] 
[INFO] --- maven-checkstyle-plugin:2.15:checkstyle (default-cli) @ hadoop-hdfs-project ---
[INFO] 
[INFO] --- findbugs-maven-plugin:3.0.0:findbugs (default-cli) @ hadoop-hdfs-project ---
[INFO] ------------------------------------------------------------------------
[INFO] Reactor Summary:
[INFO] 
[INFO] Apache Hadoop HDFS Client .......................... SUCCESS [04:06 min]
[INFO] Apache Hadoop HDFS ................................. FAILURE [  01:14 h]
[INFO] Apache Hadoop HDFS Native Client ................... SKIPPED
[INFO] Apache Hadoop HttpFS ............................... SKIPPED
[INFO] Apache Hadoop HDFS BookKeeper Journal .............. SKIPPED
[INFO] Apache Hadoop HDFS-NFS ............................. SKIPPED
[INFO] Apache Hadoop HDFS Project ......................... SUCCESS [  0.118 s]
[INFO] ------------------------------------------------------------------------
[INFO] BUILD FAILURE
[INFO] ------------------------------------------------------------------------
[INFO] Total time: 01:18 h
[INFO] Finished at: 2016-06-09T19:04:16+00:00
[INFO] Final Memory: 93M/3695M
[INFO] ------------------------------------------------------------------------
[ERROR] Failed to execute goal org.apache.maven.plugins:maven-surefire-plugin:2.17:test (default-test)
on project hadoop-hdfs: There are test failures.
[ERROR] 
[ERROR] Please refer to /home/jenkins/jenkins-slave/workspace/Hadoop-Hdfs-trunk-Java8/source/hadoop-hdfs-project/hadoop-hdfs/target/surefire-reports
for the individual test results.
[ERROR] -> [Help 1]
[ERROR] 
[ERROR] To see the full stack trace of the errors, re-run Maven with the -e switch.
[ERROR] Re-run Maven using the -X switch to enable full debug logging.
[ERROR] 
[ERROR] For more information about the errors and possible solutions, please read the following
articles:
[ERROR] [Help 1] http://cwiki.apache.org/confluence/display/MAVEN/MojoFailureException
[ERROR] 
[ERROR] After correcting the problems, you can resume the build with the command
[ERROR]   mvn <goals> -rf :hadoop-hdfs
Build step 'Execute shell' marked build as failure
Archiving artifacts
Setting LATEST1_8_HOME=/home/jenkins/jenkins-slave/tools/hudson.model.JDK/latest1.8
Setting MAVEN_3_3_3_HOME=/home/jenkins/jenkins-slave/tools/hudson.tasks.Maven_MavenInstallation/maven-3.3.3
Recording test results
Setting LATEST1_8_HOME=/home/jenkins/jenkins-slave/tools/hudson.model.JDK/latest1.8
Setting MAVEN_3_3_3_HOME=/home/jenkins/jenkins-slave/tools/hudson.tasks.Maven_MavenInstallation/maven-3.3.3
Setting LATEST1_8_HOME=/home/jenkins/jenkins-slave/tools/hudson.model.JDK/latest1.8
Setting MAVEN_3_3_3_HOME=/home/jenkins/jenkins-slave/tools/hudson.tasks.Maven_MavenInstallation/maven-3.3.3
Sending e-mails to: hdfs-dev@hadoop.apache.org
Email was triggered for: Failure - Any
Sending email for trigger: Failure - Any
Setting LATEST1_8_HOME=/home/jenkins/jenkins-slave/tools/hudson.model.JDK/latest1.8
Setting MAVEN_3_3_3_HOME=/home/jenkins/jenkins-slave/tools/hudson.tasks.Maven_MavenInstallation/maven-3.3.3
Setting LATEST1_8_HOME=/home/jenkins/jenkins-slave/tools/hudson.model.JDK/latest1.8
Setting MAVEN_3_3_3_HOME=/home/jenkins/jenkins-slave/tools/hudson.tasks.Maven_MavenInstallation/maven-3.3.3



###################################################################################
############################## FAILED TESTS (if any) ##############################
2 tests failed.
FAILED:  org.apache.hadoop.hdfs.TestAsyncHDFSWithHA.testAsyncWithHAFailover

Error Message:
expected:<10> but was:<9>

Stack Trace:
java.lang.AssertionError: expected:<10> but was:<9>
	at org.junit.Assert.fail(Assert.java:88)
	at org.junit.Assert.failNotEquals(Assert.java:743)
	at org.junit.Assert.assertEquals(Assert.java:118)
	at org.junit.Assert.assertEquals(Assert.java:555)
	at org.junit.Assert.assertEquals(Assert.java:542)
	at org.apache.hadoop.hdfs.TestAsyncHDFSWithHA.testAsyncWithHAFailover(TestAsyncHDFSWithHA.java:163)


FAILED:  org.apache.hadoop.hdfs.TestRollingUpgrade.testRollingUpgradeWithQJM

Error Message:
test timed out after 30000 milliseconds

Stack Trace:
java.lang.Exception: test timed out after 30000 milliseconds
	at java.net.SocketInputStream.socketRead0(Native Method)
	at java.net.SocketInputStream.socketRead(SocketInputStream.java:116)
	at java.net.SocketInputStream.read(SocketInputStream.java:170)
	at java.net.SocketInputStream.read(SocketInputStream.java:141)
	at java.io.BufferedInputStream.fill(BufferedInputStream.java:246)
	at java.io.BufferedInputStream.read1(BufferedInputStream.java:286)
	at java.io.BufferedInputStream.read(BufferedInputStream.java:345)
	at sun.net.www.http.HttpClient.parseHTTPHeader(HttpClient.java:704)
	at sun.net.www.http.HttpClient.parseHTTP(HttpClient.java:647)
	at sun.net.www.protocol.http.HttpURLConnection.getInputStream0(HttpURLConnection.java:1536)
	at sun.net.www.protocol.http.HttpURLConnection.getInputStream(HttpURLConnection.java:1441)
	at java.net.HttpURLConnection.getResponseCode(HttpURLConnection.java:480)
	at org.apache.hadoop.hdfs.server.namenode.EditLogFileInputStream$URLLog$1.run(EditLogFileInputStream.java:432)
	at org.apache.hadoop.hdfs.server.namenode.EditLogFileInputStream$URLLog$1.run(EditLogFileInputStream.java:421)
	at java.security.AccessController.doPrivileged(Native Method)
	at javax.security.auth.Subject.doAs(Subject.java:422)
	at org.apache.hadoop.security.UserGroupInformation.doAs(UserGroupInformation.java:1755)
	at org.apache.hadoop.security.SecurityUtil.doAsUser(SecurityUtil.java:509)
	at org.apache.hadoop.security.SecurityUtil.doAsCurrentUser(SecurityUtil.java:503)
	at org.apache.hadoop.hdfs.server.namenode.EditLogFileInputStream$URLLog.getInputStream(EditLogFileInputStream.java:420)
	at org.apache.hadoop.hdfs.server.namenode.EditLogFileInputStream.init(EditLogFileInputStream.java:140)
	at org.apache.hadoop.hdfs.server.namenode.EditLogFileInputStream.nextOpImpl(EditLogFileInputStream.java:191)
	at org.apache.hadoop.hdfs.server.namenode.EditLogFileInputStream.nextOp(EditLogFileInputStream.java:249)
	at org.apache.hadoop.hdfs.server.namenode.EditLogInputStream.readOp(EditLogInputStream.java:85)
	at org.apache.hadoop.hdfs.server.namenode.EditLogInputStream.skipUntil(EditLogInputStream.java:151)
	at org.apache.hadoop.hdfs.server.namenode.RedundantEditLogInputStream.nextOp(RedundantEditLogInputStream.java:179)
	at org.apache.hadoop.hdfs.server.namenode.EditLogInputStream.readOp(EditLogInputStream.java:85)
	at org.apache.hadoop.hdfs.server.namenode.EditLogInputStream.skipUntil(EditLogInputStream.java:151)
	at org.apache.hadoop.hdfs.server.namenode.RedundantEditLogInputStream.nextOp(RedundantEditLogInputStream.java:179)
	at org.apache.hadoop.hdfs.server.namenode.EditLogInputStream.readOp(EditLogInputStream.java:85)
	at org.apache.hadoop.hdfs.server.namenode.FSEditLogLoader.loadEditRecords(FSEditLogLoader.java:196)
	at org.apache.hadoop.hdfs.server.namenode.FSEditLogLoader.loadFSEdits(FSEditLogLoader.java:149)
	at org.apache.hadoop.hdfs.server.namenode.FSImage.loadEdits(FSImage.java:837)
	at org.apache.hadoop.hdfs.server.namenode.FSImage.loadFSImage(FSImage.java:694)
	at org.apache.hadoop.hdfs.server.namenode.FSImage.recoverTransitionRead(FSImage.java:290)
	at org.apache.hadoop.hdfs.server.namenode.FSNamesystem.loadFSImage(FSNamesystem.java:1016)
	at org.apache.hadoop.hdfs.server.namenode.FSNamesystem.loadFromDisk(FSNamesystem.java:668)
	at org.apache.hadoop.hdfs.server.namenode.NameNode.loadNamesystem(NameNode.java:650)
	at org.apache.hadoop.hdfs.server.namenode.NameNode.initialize(NameNode.java:712)
	at org.apache.hadoop.hdfs.server.namenode.NameNode.<init>(NameNode.java:928)
	at org.apache.hadoop.hdfs.server.namenode.NameNode.<init>(NameNode.java:907)
	at org.apache.hadoop.hdfs.server.namenode.NameNode.createNameNode(NameNode.java:1624)
	at org.apache.hadoop.hdfs.MiniDFSCluster.restartNameNode(MiniDFSCluster.java:2038)
	at org.apache.hadoop.hdfs.MiniDFSCluster.restartNameNode(MiniDFSCluster.java:2003)
	at org.apache.hadoop.hdfs.TestRollingUpgrade.testRollingUpgradeWithQJM(TestRollingUpgrade.java:246)




Mime
View raw message