hadoop-hdfs-dev mailing list archives

Site index · List index
Message view « Date » · « Thread »
Top « Date » · « Thread »
From Apache Jenkins Server <jenk...@builds.apache.org>
Subject Build failed in Jenkins: Hadoop-Hdfs-trunk-Java8 #1312
Date Tue, 07 Jun 2016 08:04:02 GMT
See <https://builds.apache.org/job/Hadoop-Hdfs-trunk-Java8/1312/changes>

Changes:

[rohithsharmaks] YARN-5118. Tests fails with localizer port bind exception. Contributed

------------------------------------------
[...truncated 8379 lines...]
Running org.apache.hadoop.hdfs.TestDFSStripedOutputStreamWithFailure130
Tests run: 10, Failures: 0, Errors: 0, Skipped: 0, Time elapsed: 0.339 sec - in org.apache.hadoop.hdfs.TestDFSStripedOutputStreamWithFailure130
Running org.apache.hadoop.hdfs.TestDFSUpgrade
Tests run: 26, Failures: 0, Errors: 0, Skipped: 0, Time elapsed: 74.859 sec - in org.apache.hadoop.hdfs.TestEncryptionZones
Running org.apache.hadoop.hdfs.TestSnapshotCommands
Tests run: 2, Failures: 0, Errors: 0, Skipped: 0, Time elapsed: 19.087 sec - in org.apache.hadoop.hdfs.TestDFSUpgrade
Tests run: 6, Failures: 0, Errors: 0, Skipped: 0, Time elapsed: 5.421 sec - in org.apache.hadoop.hdfs.TestSnapshotCommands
Running org.apache.hadoop.hdfs.TestDataTransferProtocol
Running org.apache.hadoop.hdfs.TestDFSStripedOutputStreamWithFailure200
Tests run: 10, Failures: 0, Errors: 0, Skipped: 0, Time elapsed: 0.353 sec - in org.apache.hadoop.hdfs.TestDFSStripedOutputStreamWithFailure200
Running org.apache.hadoop.hdfs.TestFileCreation
Tests run: 8, Failures: 0, Errors: 0, Skipped: 0, Time elapsed: 60.171 sec - in org.apache.hadoop.hdfs.TestClientProtocolForPipelineRecovery
Tests run: 4, Failures: 0, Errors: 0, Skipped: 0, Time elapsed: 8.706 sec - in org.apache.hadoop.hdfs.TestDataTransferProtocol
Running org.apache.hadoop.hdfs.TestDFSInotifyEventInputStream
Running org.apache.hadoop.hdfs.TestDFSUpgradeFromImage
Tests run: 5, Failures: 0, Errors: 0, Skipped: 0, Time elapsed: 23.29 sec - in org.apache.hadoop.hdfs.TestDFSInotifyEventInputStream
Running org.apache.hadoop.hdfs.TestEncryptionZonesWithKMS
Tests run: 8, Failures: 0, Errors: 0, Skipped: 0, Time elapsed: 54.248 sec - in org.apache.hadoop.hdfs.TestDFSUpgradeFromImage
Running org.apache.hadoop.hdfs.TestDecommission
Tests run: 44, Failures: 0, Errors: 0, Skipped: 0, Time elapsed: 167.527 sec - in org.apache.hadoop.hdfs.TestHDFSFileSystemContract
Running org.apache.hadoop.hdfs.TestDFSUtil
Tests run: 31, Failures: 0, Errors: 0, Skipped: 0, Time elapsed: 3.077 sec - in org.apache.hadoop.hdfs.TestDFSUtil
Running org.apache.hadoop.hdfs.TestGetBlocks
Tests run: 23, Failures: 0, Errors: 0, Skipped: 0, Time elapsed: 102.806 sec - in org.apache.hadoop.hdfs.TestFileCreation
Running org.apache.hadoop.hdfs.TestDFSStripedOutputStreamWithFailure060
Tests run: 3, Failures: 0, Errors: 0, Skipped: 0, Time elapsed: 45.646 sec - in org.apache.hadoop.hdfs.TestGetBlocks
Running org.apache.hadoop.hdfs.TestMultiThreadedHflush
Tests run: 28, Failures: 0, Errors: 0, Skipped: 0, Time elapsed: 105.075 sec - in org.apache.hadoop.hdfs.TestEncryptionZonesWithKMS
Running org.apache.hadoop.hdfs.util.TestCyclicIteration
Tests run: 1, Failures: 0, Errors: 0, Skipped: 0, Time elapsed: 0.077 sec - in org.apache.hadoop.hdfs.util.TestCyclicIteration
Running org.apache.hadoop.hdfs.util.TestBestEffortLongFile
Tests run: 2, Failures: 0, Errors: 0, Skipped: 0, Time elapsed: 0.259 sec - in org.apache.hadoop.hdfs.util.TestBestEffortLongFile
Running org.apache.hadoop.hdfs.util.TestDiff
Tests run: 1, Failures: 0, Errors: 0, Skipped: 0, Time elapsed: 2.772 sec - in org.apache.hadoop.hdfs.util.TestDiff
Running org.apache.hadoop.hdfs.util.TestStripedBlockUtil
Tests run: 3, Failures: 0, Errors: 0, Skipped: 0, Time elapsed: 12.852 sec - in org.apache.hadoop.hdfs.TestMultiThreadedHflush
Tests run: 3, Failures: 0, Errors: 0, Skipped: 0, Time elapsed: 3.501 sec - in org.apache.hadoop.hdfs.util.TestStripedBlockUtil
Running org.apache.hadoop.hdfs.util.TestCombinedHostsFileReader
Running org.apache.hadoop.hdfs.util.TestXMLUtils
Tests run: 6, Failures: 0, Errors: 0, Skipped: 0, Time elapsed: 0.073 sec - in org.apache.hadoop.hdfs.util.TestXMLUtils
Tests run: 2, Failures: 0, Errors: 0, Skipped: 0, Time elapsed: 0.367 sec - in org.apache.hadoop.hdfs.util.TestCombinedHostsFileReader
Running org.apache.hadoop.hdfs.util.TestMD5FileUtils
Running org.apache.hadoop.hdfs.util.TestLightWeightHashSet
Tests run: 14, Failures: 0, Errors: 0, Skipped: 0, Time elapsed: 0.216 sec - in org.apache.hadoop.hdfs.util.TestLightWeightHashSet
Tests run: 5, Failures: 0, Errors: 0, Skipped: 0, Time elapsed: 0.472 sec - in org.apache.hadoop.hdfs.util.TestMD5FileUtils
Running org.apache.hadoop.hdfs.util.TestLightWeightLinkedSet
Tests run: 17, Failures: 0, Errors: 0, Skipped: 0, Time elapsed: 0.227 sec - in org.apache.hadoop.hdfs.util.TestLightWeightLinkedSet
Running org.apache.hadoop.hdfs.util.TestAtomicFileOutputStream
Running org.apache.hadoop.hdfs.TestLease
Tests run: 4, Failures: 0, Errors: 0, Skipped: 1, Time elapsed: 0.463 sec - in org.apache.hadoop.hdfs.util.TestAtomicFileOutputStream
Running org.apache.hadoop.hdfs.TestInjectionForSimulatedStorage
Tests run: 5, Failures: 0, Errors: 0, Skipped: 0, Time elapsed: 12.995 sec - in org.apache.hadoop.hdfs.TestLease
Running org.apache.hadoop.hdfs.TestHFlush
Tests run: 1, Failures: 0, Errors: 0, Skipped: 0, Time elapsed: 16.111 sec - in org.apache.hadoop.hdfs.TestInjectionForSimulatedStorage
Running org.apache.hadoop.hdfs.TestErasureCodingPolicies
Tests run: 10, Failures: 0, Errors: 0, Skipped: 0, Time elapsed: 21.903 sec - in org.apache.hadoop.hdfs.TestErasureCodingPolicies
Running org.apache.hadoop.hdfs.TestHDFSPolicyProvider
Tests run: 3, Failures: 0, Errors: 0, Skipped: 0, Time elapsed: 0.239 sec - in org.apache.hadoop.hdfs.TestHDFSPolicyProvider
Running org.apache.hadoop.hdfs.TestHdfsAdmin
Tests run: 2, Failures: 0, Errors: 0, Skipped: 0, Time elapsed: 5.402 sec - in org.apache.hadoop.hdfs.TestHdfsAdmin
Tests run: 10, Failures: 0, Errors: 0, Skipped: 0, Time elapsed: 89.59 sec - in org.apache.hadoop.hdfs.TestDFSStripedOutputStreamWithFailure060
Running org.apache.hadoop.hdfs.TestDistributedFileSystem
Running org.apache.hadoop.hdfs.TestRollingUpgradeRollback
Tests run: 3, Failures: 0, Errors: 0, Skipped: 0, Time elapsed: 14.347 sec - in org.apache.hadoop.hdfs.TestRollingUpgradeRollback
Running org.apache.hadoop.hdfs.TestRollingUpgrade
Tests run: 14, Failures: 0, Errors: 0, Skipped: 0, Time elapsed: 48.698 sec - in org.apache.hadoop.hdfs.TestHFlush
Running org.apache.hadoop.hdfs.TestDatanodeDeath
Tests run: 19, Failures: 0, Errors: 0, Skipped: 1, Time elapsed: 186.306 sec - in org.apache.hadoop.hdfs.TestDecommission
Running org.apache.hadoop.hdfs.TestCrcCorruption
Tests run: 24, Failures: 0, Errors: 0, Skipped: 0, Time elapsed: 74.18 sec - in org.apache.hadoop.hdfs.TestDistributedFileSystem
Running org.apache.hadoop.hdfs.TestFsShellPermission
Tests run: 4, Failures: 0, Errors: 0, Skipped: 0, Time elapsed: 21.35 sec - in org.apache.hadoop.hdfs.TestCrcCorruption
Running org.apache.hadoop.hdfs.protocol.TestLocatedBlock
Tests run: 1, Failures: 0, Errors: 0, Skipped: 0, Time elapsed: 0.28 sec - in org.apache.hadoop.hdfs.protocol.TestLocatedBlock
Running org.apache.hadoop.hdfs.protocol.TestLayoutVersion
Tests run: 11, Failures: 0, Errors: 0, Skipped: 0, Time elapsed: 0.272 sec - in org.apache.hadoop.hdfs.protocol.TestLayoutVersion
Tests run: 4, Failures: 0, Errors: 0, Skipped: 0, Time elapsed: 62.746 sec - in org.apache.hadoop.hdfs.TestDatanodeDeath
Running org.apache.hadoop.hdfs.protocol.datatransfer.sasl.TestSaslDataTransfer
Running org.apache.hadoop.hdfs.protocol.datatransfer.TestPacketReceiver
Tests run: 1, Failures: 0, Errors: 0, Skipped: 0, Time elapsed: 0.394 sec - in org.apache.hadoop.hdfs.protocol.datatransfer.TestPacketReceiver
Tests run: 1, Failures: 0, Errors: 0, Skipped: 0, Time elapsed: 5.662 sec - in org.apache.hadoop.hdfs.TestFsShellPermission
Running org.apache.hadoop.hdfs.protocol.TestAnnotations
Tests run: 1, Failures: 0, Errors: 0, Skipped: 0, Time elapsed: 0.114 sec - in org.apache.hadoop.hdfs.protocol.TestAnnotations
Running org.apache.hadoop.hdfs.protocol.TestBlockListAsLongs
Running org.apache.hadoop.hdfs.TestDFSStripedOutputStreamWithFailure170
Tests run: 7, Failures: 0, Errors: 0, Skipped: 0, Time elapsed: 0.97 sec - in org.apache.hadoop.hdfs.protocol.TestBlockListAsLongs
Running org.apache.hadoop.hdfs.TestDFSStripedOutputStreamWithFailure190
Tests run: 9, Failures: 0, Errors: 0, Skipped: 0, Time elapsed: 22.968 sec - in org.apache.hadoop.hdfs.protocol.datatransfer.sasl.TestSaslDataTransfer
Running org.apache.hadoop.hdfs.TestDFSAddressConfig
Tests run: 1, Failures: 0, Errors: 0, Skipped: 0, Time elapsed: 6.349 sec - in org.apache.hadoop.hdfs.TestDFSAddressConfig
Running org.apache.hadoop.hdfs.TestDFSConfigKeys
Tests run: 1, Failures: 0, Errors: 0, Skipped: 0, Time elapsed: 0.289 sec - in org.apache.hadoop.hdfs.TestDFSConfigKeys
Running org.apache.hadoop.hdfs.TestParallelUnixDomainRead
Tests run: 10, Failures: 0, Errors: 0, Skipped: 0, Time elapsed: 55.392 sec - in org.apache.hadoop.hdfs.TestDFSStripedOutputStreamWithFailure170
Running org.apache.hadoop.hdfs.TestDFSStripedOutputStreamWithFailure140
Tests run: 10, Failures: 0, Errors: 0, Skipped: 0, Time elapsed: 0.39 sec - in org.apache.hadoop.hdfs.TestDFSStripedOutputStreamWithFailure140
Running org.apache.hadoop.hdfs.TestDFSStripedOutputStreamWithFailure100
Tests run: 10, Failures: 0, Errors: 0, Skipped: 0, Time elapsed: 56.468 sec - in org.apache.hadoop.hdfs.TestDFSStripedOutputStreamWithFailure190
Running org.apache.hadoop.hdfs.TestReplication
Tests run: 12, Failures: 0, Errors: 0, Skipped: 0, Time elapsed: 126.127 sec - in org.apache.hadoop.hdfs.TestRollingUpgrade
Running org.apache.hadoop.hdfs.TestAsyncDFS
Tests run: 4, Failures: 0, Errors: 0, Skipped: 0, Time elapsed: 40.954 sec - in org.apache.hadoop.hdfs.TestParallelUnixDomainRead
Running org.apache.hadoop.hdfs.TestFileChecksum
Tests run: 4, Failures: 0, Errors: 0, Skipped: 0, Time elapsed: 11.111 sec - in org.apache.hadoop.hdfs.TestAsyncDFS
Running org.apache.hadoop.hdfs.TestRead
Tests run: 3, Failures: 0, Errors: 0, Skipped: 0, Time elapsed: 10.073 sec - in org.apache.hadoop.hdfs.TestRead
Running org.apache.hadoop.hdfs.TestPipelines
Tests run: 1, Failures: 0, Errors: 0, Skipped: 0, Time elapsed: 7.576 sec - in org.apache.hadoop.hdfs.TestPipelines
Running org.apache.hadoop.hdfs.TestDFSStripedOutputStreamWithFailure
Tests run: 10, Failures: 0, Errors: 0, Skipped: 0, Time elapsed: 54.683 sec - in org.apache.hadoop.hdfs.TestDFSStripedOutputStreamWithFailure100
Running org.apache.hadoop.hdfs.TestDeprecatedKeys
Tests run: 1, Failures: 0, Errors: 0, Skipped: 0, Time elapsed: 0.473 sec - in org.apache.hadoop.hdfs.TestDeprecatedKeys
Running org.apache.hadoop.hdfs.TestAclsEndToEnd
Tests run: 9, Failures: 0, Errors: 0, Skipped: 0, Time elapsed: 62.119 sec - in org.apache.hadoop.hdfs.TestReplication
Running org.apache.hadoop.hdfs.TestParallelShortCircuitReadNoChecksum
Tests run: 4, Failures: 0, Errors: 0, Skipped: 0, Time elapsed: 15.931 sec - in org.apache.hadoop.hdfs.TestParallelShortCircuitReadNoChecksum
Running org.apache.hadoop.hdfs.TestParallelShortCircuitRead
Tests run: 10, Failures: 0, Errors: 0, Skipped: 0, Time elapsed: 73.796 sec - in org.apache.hadoop.hdfs.TestFileChecksum
Running org.apache.hadoop.hdfs.TestHDFSTrash
Tests run: 4, Failures: 0, Errors: 0, Skipped: 0, Time elapsed: 15.341 sec - in org.apache.hadoop.hdfs.TestParallelShortCircuitRead
Tests run: 2, Failures: 0, Errors: 0, Skipped: 0, Time elapsed: 7.81 sec - in org.apache.hadoop.hdfs.TestHDFSTrash
Running org.apache.hadoop.hdfs.TestFileAppend
Running org.apache.hadoop.hdfs.TestDFSRemove
Tests run: 1, Failures: 0, Errors: 0, Skipped: 0, Time elapsed: 20.209 sec - in org.apache.hadoop.hdfs.TestDFSRemove
Running org.apache.hadoop.hdfs.TestErasureCodingPolicyWithSnapshot
Tests run: 4, Failures: 0, Errors: 0, Skipped: 0, Time elapsed: 25.849 sec - in org.apache.hadoop.hdfs.TestErasureCodingPolicyWithSnapshot
Running org.apache.hadoop.hdfs.TestDFSRollback
Tests run: 12, Failures: 0, Errors: 0, Skipped: 0, Time elapsed: 48.496 sec - in org.apache.hadoop.hdfs.TestFileAppend
Running org.apache.hadoop.hdfs.TestReadWhileWriting
Tests run: 1, Failures: 0, Errors: 0, Skipped: 0, Time elapsed: 8.774 sec - in org.apache.hadoop.hdfs.TestReadWhileWriting
Running org.apache.hadoop.hdfs.TestConnCache
Tests run: 9, Failures: 0, Errors: 0, Skipped: 0, Time elapsed: 102.04 sec - in org.apache.hadoop.hdfs.TestAclsEndToEnd
Running org.apache.hadoop.hdfs.TestPersistBlocks
Tests run: 4, Failures: 0, Errors: 0, Skipped: 0, Time elapsed: 124.706 sec - in org.apache.hadoop.hdfs.TestDFSStripedOutputStreamWithFailure
Running org.apache.hadoop.hdfs.TestSetrepDecreasing
Tests run: 1, Failures: 0, Errors: 0, Skipped: 0, Time elapsed: 5.421 sec - in org.apache.hadoop.hdfs.TestConnCache
Running org.apache.hadoop.hdfs.TestDatanodeLayoutUpgrade
Tests run: 1, Failures: 0, Errors: 0, Skipped: 0, Time elapsed: 21.344 sec - in org.apache.hadoop.hdfs.TestDFSRollback
Running org.apache.hadoop.hdfs.TestFileCorruption
Tests run: 2, Failures: 0, Errors: 0, Skipped: 0, Time elapsed: 8.184 sec - in org.apache.hadoop.hdfs.TestDatanodeLayoutUpgrade
Running org.apache.hadoop.hdfs.TestDFSStartupVersions
Tests run: 1, Failures: 0, Errors: 0, Skipped: 0, Time elapsed: 18.841 sec - in org.apache.hadoop.hdfs.TestSetrepDecreasing
Tests run: 4, Failures: 0, Errors: 0, Skipped: 0, Time elapsed: 12.289 sec - in org.apache.hadoop.hdfs.TestFileCorruption
Running org.apache.hadoop.hdfs.TestWriteConfigurationToDFS
Running org.apache.hadoop.hdfs.TestListFilesInDFS
Tests run: 1, Failures: 0, Errors: 0, Skipped: 0, Time elapsed: 15.274 sec - in org.apache.hadoop.hdfs.TestDFSStartupVersions
Tests run: 1, Failures: 0, Errors: 0, Skipped: 0, Time elapsed: 6.805 sec - in org.apache.hadoop.hdfs.TestWriteConfigurationToDFS
Tests run: 2, Failures: 0, Errors: 0, Skipped: 0, Time elapsed: 6.518 sec - in org.apache.hadoop.hdfs.TestListFilesInDFS
Tests run: 5, Failures: 0, Errors: 0, Skipped: 0, Time elapsed: 28.81 sec - in org.apache.hadoop.hdfs.TestPersistBlocks

Results :

Tests in error: 
  TestPendingInvalidateBlock.testPendingDeleteUnknownBlocks:160 » Bind Problem b...
  TestBalancerWithMultipleNameNodes.testBalancing2OutOf3Blockpools:516->unevenDistribution:405
» IO
  TestBalancer.testBalancerWithKeytabs:1947->access$000:125->testUnknownDatanode:1098
» 

Tests run: 4435, Failures: 0, Errors: 3, Skipped: 17

[INFO]                                                                         
[INFO] ------------------------------------------------------------------------
[INFO] Skipping Apache Hadoop HDFS Native Client
[INFO] This project has been banned from the build due to previous failures.
[INFO] ------------------------------------------------------------------------
[INFO]                                                                         
[INFO] ------------------------------------------------------------------------
[INFO] Skipping Apache Hadoop HttpFS
[INFO] This project has been banned from the build due to previous failures.
[INFO] ------------------------------------------------------------------------
[INFO]                                                                         
[INFO] ------------------------------------------------------------------------
[INFO] Skipping Apache Hadoop HDFS BookKeeper Journal
[INFO] This project has been banned from the build due to previous failures.
[INFO] ------------------------------------------------------------------------
[INFO]                                                                         
[INFO] ------------------------------------------------------------------------
[INFO] Skipping Apache Hadoop HDFS-NFS
[INFO] This project has been banned from the build due to previous failures.
[INFO] ------------------------------------------------------------------------
[INFO]                                                                         
[INFO] ------------------------------------------------------------------------
[INFO] Building Apache Hadoop HDFS Project 3.0.0-alpha1-SNAPSHOT
[INFO] ------------------------------------------------------------------------
[INFO] 
[INFO] --- maven-clean-plugin:2.5:clean (default-clean) @ hadoop-hdfs-project ---
[INFO] Deleting <https://builds.apache.org/job/Hadoop-Hdfs-trunk-Java8/ws/source/hadoop-hdfs-project/target>
[INFO] 
[INFO] --- maven-antrun-plugin:1.7:run (create-testdirs) @ hadoop-hdfs-project ---
[INFO] Executing tasks

main:
    [mkdir] Created dir: <https://builds.apache.org/job/Hadoop-Hdfs-trunk-Java8/ws/source/hadoop-hdfs-project/target/test-dir>
[INFO] Executed tasks
[INFO] 
[INFO] --- maven-source-plugin:2.3:jar-no-fork (hadoop-java-sources) @ hadoop-hdfs-project
---
[INFO] 
[INFO] --- maven-source-plugin:2.3:test-jar-no-fork (hadoop-java-sources) @ hadoop-hdfs-project
---
[INFO] 
[INFO] --- maven-enforcer-plugin:1.3.1:enforce (dist-enforce) @ hadoop-hdfs-project ---
[INFO] 
[INFO] --- maven-site-plugin:3.5:attach-descriptor (attach-descriptor) @ hadoop-hdfs-project
---
[INFO] 
[INFO] --- maven-javadoc-plugin:2.8.1:jar (module-javadocs) @ hadoop-hdfs-project ---
[INFO] Not executing Javadoc as the project is not a Java classpath-capable package
[INFO] 
[INFO] --- maven-enforcer-plugin:1.3.1:enforce (depcheck) @ hadoop-hdfs-project ---
[INFO] 
[INFO] --- maven-checkstyle-plugin:2.15:checkstyle (default-cli) @ hadoop-hdfs-project ---
[INFO] 
[INFO] --- findbugs-maven-plugin:3.0.0:findbugs (default-cli) @ hadoop-hdfs-project ---
[INFO] ------------------------------------------------------------------------
[INFO] Reactor Summary:
[INFO] 
[INFO] Apache Hadoop HDFS Client .......................... SUCCESS [04:06 min]
[INFO] Apache Hadoop HDFS ................................. FAILURE [  01:08 h]
[INFO] Apache Hadoop HDFS Native Client ................... SKIPPED
[INFO] Apache Hadoop HttpFS ............................... SKIPPED
[INFO] Apache Hadoop HDFS BookKeeper Journal .............. SKIPPED
[INFO] Apache Hadoop HDFS-NFS ............................. SKIPPED
[INFO] Apache Hadoop HDFS Project ......................... SUCCESS [  0.081 s]
[INFO] ------------------------------------------------------------------------
[INFO] BUILD FAILURE
[INFO] ------------------------------------------------------------------------
[INFO] Total time: 01:12 h
[INFO] Finished at: 2016-06-07T08:03:45+00:00
[INFO] Final Memory: 93M/3824M
[INFO] ------------------------------------------------------------------------
[ERROR] Failed to execute goal org.apache.maven.plugins:maven-surefire-plugin:2.17:test (default-test)
on project hadoop-hdfs: There are test failures.
[ERROR] 
[ERROR] Please refer to <https://builds.apache.org/job/Hadoop-Hdfs-trunk-Java8/ws/source/hadoop-hdfs-project/hadoop-hdfs/target/surefire-reports>
for the individual test results.
[ERROR] -> [Help 1]
[ERROR] 
[ERROR] To see the full stack trace of the errors, re-run Maven with the -e switch.
[ERROR] Re-run Maven using the -X switch to enable full debug logging.
[ERROR] 
[ERROR] For more information about the errors and possible solutions, please read the following
articles:
[ERROR] [Help 1] http://cwiki.apache.org/confluence/display/MAVEN/MojoFailureException
[ERROR] 
[ERROR] After correcting the problems, you can resume the build with the command
[ERROR]   mvn <goals> -rf :hadoop-hdfs
Build step 'Execute shell' marked build as failure
Archiving artifacts
Setting LATEST1_8_HOME=/home/jenkins/jenkins-slave/tools/hudson.model.JDK/latest1.8
Setting MAVEN_3_3_3_HOME=/home/jenkins/jenkins-slave/tools/hudson.tasks.Maven_MavenInstallation/maven-3.3.3
Recording test results
Setting LATEST1_8_HOME=/home/jenkins/jenkins-slave/tools/hudson.model.JDK/latest1.8
Setting MAVEN_3_3_3_HOME=/home/jenkins/jenkins-slave/tools/hudson.tasks.Maven_MavenInstallation/maven-3.3.3
Setting LATEST1_8_HOME=/home/jenkins/jenkins-slave/tools/hudson.model.JDK/latest1.8
Setting MAVEN_3_3_3_HOME=/home/jenkins/jenkins-slave/tools/hudson.tasks.Maven_MavenInstallation/maven-3.3.3

---------------------------------------------------------------------
To unsubscribe, e-mail: hdfs-dev-unsubscribe@hadoop.apache.org
For additional commands, e-mail: hdfs-dev-help@hadoop.apache.org


Mime
View raw message