hadoop-hdfs-dev mailing list archives

Site index · List index
Message view « Date » · « Thread »
Top « Date » · « Thread »
From Apache Jenkins Server <jenk...@builds.apache.org>
Subject Build failed in Jenkins: Hadoop-Hdfs-trunk-Java8 #1296
Date Thu, 02 Jun 2016 11:46:08 GMT
See <https://builds.apache.org/job/Hadoop-Hdfs-trunk-Java8/1296/changes>

Changes:

[aajisaka] HDFS-9476. TestDFSUpgradeFromImage#testUpgradeFromRel1BBWImage

[aajisaka] HADOOP-13232. Typo in exception in ValueQueue.java. Contributed by Jiayi

------------------------------------------
[...truncated 5250 lines...]
Running org.apache.hadoop.hdfs.TestDFSStripedOutputStreamWithFailure
Tests run: 1, Failures: 0, Errors: 0, Skipped: 0, Time elapsed: 49.908 sec - in org.apache.hadoop.hdfs.TestAsyncHDFSWithHA
Running org.apache.hadoop.hdfs.TestEncryptedTransfer
Tests run: 10, Failures: 0, Errors: 0, Skipped: 0, Time elapsed: 27.119 sec - in org.apache.hadoop.hdfs.TestDFSStripedOutputStreamWithFailure000
Running org.apache.hadoop.hdfs.TestDatanodeDeath
Tests run: 4, Failures: 0, Errors: 0, Skipped: 0, Time elapsed: 60.488 sec - in org.apache.hadoop.hdfs.TestDatanodeDeath
Running org.apache.hadoop.hdfs.TestHDFSFileSystemContract
Tests run: 4, Failures: 0, Errors: 0, Skipped: 0, Time elapsed: 93.658 sec - in org.apache.hadoop.hdfs.TestDFSStripedOutputStreamWithFailure
Running org.apache.hadoop.hdfs.TestHFlush
Tests run: 12, Failures: 0, Errors: 0, Skipped: 0, Time elapsed: 140.129 sec - in org.apache.hadoop.hdfs.TestDFSClientRetries
Running org.apache.hadoop.hdfs.TestDisableConnCache
Tests run: 1, Failures: 0, Errors: 0, Skipped: 0, Time elapsed: 4.763 sec - in org.apache.hadoop.hdfs.TestDisableConnCache
Running org.apache.hadoop.hdfs.TestParallelUnixDomainRead
Tests run: 26, Failures: 0, Errors: 0, Skipped: 0, Time elapsed: 113.901 sec - in org.apache.hadoop.hdfs.TestEncryptedTransfer
Running org.apache.hadoop.hdfs.TestClientProtocolForPipelineRecovery
Tests run: 14, Failures: 0, Errors: 0, Skipped: 0, Time elapsed: 30.224 sec - in org.apache.hadoop.hdfs.TestHFlush
Running org.apache.hadoop.hdfs.TestHDFSPolicyProvider
Tests run: 3, Failures: 0, Errors: 0, Skipped: 0, Time elapsed: 0.317 sec - in org.apache.hadoop.hdfs.TestHDFSPolicyProvider
Running org.apache.hadoop.hdfs.TestWriteReadStripedFile
Tests run: 4, Failures: 0, Errors: 0, Skipped: 0, Time elapsed: 37.876 sec - in org.apache.hadoop.hdfs.TestParallelUnixDomainRead
Running org.apache.hadoop.hdfs.TestDFSClientExcludedNodes
Tests run: 2, Failures: 0, Errors: 0, Skipped: 0, Time elapsed: 12.51 sec - in org.apache.hadoop.hdfs.TestDFSClientExcludedNodes
Running org.apache.hadoop.hdfs.TestDatanodeReport
Tests run: 8, Failures: 0, Errors: 0, Skipped: 0, Time elapsed: 53.983 sec - in org.apache.hadoop.hdfs.TestClientProtocolForPipelineRecovery
Running org.apache.hadoop.hdfs.TestMiniDFSCluster
Tests run: 7, Failures: 0, Errors: 0, Skipped: 0, Time elapsed: 11.47 sec - in org.apache.hadoop.hdfs.TestMiniDFSCluster
Tests run: 2, Failures: 0, Errors: 0, Skipped: 0, Time elapsed: 21.967 sec - in org.apache.hadoop.hdfs.TestDatanodeReport
Running org.apache.hadoop.hdfs.TestBlocksScheduledCounter
Running org.apache.hadoop.hdfs.TestDFSClientSocketSize
Tests run: 3, Failures: 0, Errors: 0, Skipped: 0, Time elapsed: 6.376 sec - in org.apache.hadoop.hdfs.TestDFSClientSocketSize
Tests run: 2, Failures: 0, Errors: 0, Skipped: 0, Time elapsed: 6.538 sec - in org.apache.hadoop.hdfs.TestBlocksScheduledCounter
Running org.apache.hadoop.hdfs.TestDFSStorageStateRecovery
Running org.apache.hadoop.hdfs.TestSnapshotCommands
Tests run: 44, Failures: 0, Errors: 0, Skipped: 0, Time elapsed: 121.634 sec - in org.apache.hadoop.hdfs.TestHDFSFileSystemContract
Running org.apache.hadoop.hdfs.TestParallelShortCircuitRead
Tests run: 6, Failures: 0, Errors: 0, Skipped: 0, Time elapsed: 5.3 sec - in org.apache.hadoop.hdfs.TestSnapshotCommands
Running org.apache.hadoop.hdfs.TestDFSPermission
Tests run: 4, Failures: 0, Errors: 0, Skipped: 0, Time elapsed: 15.184 sec - in org.apache.hadoop.hdfs.TestParallelShortCircuitRead
Running org.apache.hadoop.hdfs.TestDFSStripedOutputStreamWithFailure170
Tests run: 10, Failures: 0, Errors: 0, Skipped: 0, Time elapsed: 0.398 sec - in org.apache.hadoop.hdfs.TestDFSStripedOutputStreamWithFailure170
Running org.apache.hadoop.hdfs.TestParallelRead
Tests run: 8, Failures: 0, Errors: 0, Skipped: 0, Time elapsed: 23.294 sec - in org.apache.hadoop.hdfs.TestDFSPermission
Running org.apache.hadoop.hdfs.TestDFSStripedOutputStream
Tests run: 17, Failures: 0, Errors: 0, Skipped: 0, Time elapsed: 124.417 sec - in org.apache.hadoop.hdfs.TestWriteReadStripedFile
Running org.apache.hadoop.hdfs.TestAclsEndToEnd
Tests run: 4, Failures: 0, Errors: 0, Skipped: 0, Time elapsed: 41.718 sec - in org.apache.hadoop.hdfs.TestParallelRead
Running org.apache.hadoop.hdfs.TestRollingUpgradeRollback
Tests run: 3, Failures: 0, Errors: 0, Skipped: 0, Time elapsed: 68.242 sec - in org.apache.hadoop.hdfs.TestDFSStorageStateRecovery
Running org.apache.hadoop.hdfs.TestDFSConfigKeys
Tests run: 1, Failures: 0, Errors: 0, Skipped: 0, Time elapsed: 0.337 sec - in org.apache.hadoop.hdfs.TestDFSConfigKeys
Running org.apache.hadoop.hdfs.TestRollingUpgradeDowngrade
Tests run: 3, Failures: 0, Errors: 0, Skipped: 0, Time elapsed: 11.791 sec - in org.apache.hadoop.hdfs.TestRollingUpgradeRollback
Running org.apache.hadoop.hdfs.TestDFSUtil
Tests run: 31, Failures: 0, Errors: 0, Skipped: 0, Time elapsed: 3.345 sec - in org.apache.hadoop.hdfs.TestDFSUtil
Tests run: 2, Failures: 0, Errors: 0, Skipped: 0, Time elapsed: 8.589 sec - in org.apache.hadoop.hdfs.TestRollingUpgradeDowngrade
Running org.apache.hadoop.hdfs.TestDatanodeStartupFixesLegacyStorageIDs
Running org.apache.hadoop.hdfs.TestExternalBlockReader
Tests run: 14, Failures: 0, Errors: 0, Skipped: 0, Time elapsed: 51.738 sec - in org.apache.hadoop.hdfs.TestDFSStripedOutputStream
Running org.apache.hadoop.hdfs.TestDeprecatedKeys
Tests run: 1, Failures: 0, Errors: 0, Skipped: 0, Time elapsed: 0.598 sec - in org.apache.hadoop.hdfs.TestDeprecatedKeys
Running org.apache.hadoop.hdfs.TestGetBlocks
Tests run: 3, Failures: 0, Errors: 0, Skipped: 0, Time elapsed: 6.347 sec - in org.apache.hadoop.hdfs.TestDatanodeStartupFixesLegacyStorageIDs
Tests run: 2, Failures: 0, Errors: 0, Skipped: 0, Time elapsed: 6.005 sec - in org.apache.hadoop.hdfs.TestExternalBlockReader
Running org.apache.hadoop.hdfs.TestParallelReadUtil
Running org.apache.hadoop.hdfs.TestRead
Tests run: 1, Failures: 0, Errors: 0, Skipped: 1, Time elapsed: 0.036 sec - in org.apache.hadoop.hdfs.TestParallelReadUtil
Running org.apache.hadoop.hdfs.shortcircuit.TestShortCircuitCache
ERROR: Could not install LATEST1_8_HOME
java.lang.NullPointerException
	at hudson.plugins.toolenv.ToolEnvBuildWrapper$1.buildEnvVars(ToolEnvBuildWrapper.java:46)
	at hudson.model.AbstractBuild.getEnvironment(AbstractBuild.java:947)
	at hudson.plugins.git.GitSCM.getParamExpandedRepos(GitSCM.java:390)
	at hudson.plugins.git.GitSCM.compareRemoteRevisionWithImpl(GitSCM.java:577)
	at hudson.plugins.git.GitSCM.compareRemoteRevisionWith(GitSCM.java:527)
	at hudson.scm.SCM.compareRemoteRevisionWith(SCM.java:381)
	at hudson.scm.SCM.poll(SCM.java:398)
	at hudson.model.AbstractProject._poll(AbstractProject.java:1453)
	at hudson.model.AbstractProject.poll(AbstractProject.java:1356)
	at hudson.triggers.SCMTrigger$Runner.runPolling(SCMTrigger.java:526)
	at hudson.triggers.SCMTrigger$Runner.run(SCMTrigger.java:555)
	at hudson.util.SequentialExecutionQueue$QueueEntry.run(SequentialExecutionQueue.java:119)
	at java.util.concurrent.Executors$RunnableAdapter.call(Executors.java:471)
	at java.util.concurrent.FutureTask.run(FutureTask.java:262)
	at java.util.concurrent.ThreadPoolExecutor.runWorker(ThreadPoolExecutor.java:1145)
	at java.util.concurrent.ThreadPoolExecutor$Worker.run(ThreadPoolExecutor.java:615)
	at java.lang.Thread.run(Thread.java:745)
ERROR: Could not install MAVEN_3_3_3_HOME
java.lang.NullPointerException
	at hudson.plugins.toolenv.ToolEnvBuildWrapper$1.buildEnvVars(ToolEnvBuildWrapper.java:46)
	at hudson.model.AbstractBuild.getEnvironment(AbstractBuild.java:947)
	at hudson.plugins.git.GitSCM.getParamExpandedRepos(GitSCM.java:390)
	at hudson.plugins.git.GitSCM.compareRemoteRevisionWithImpl(GitSCM.java:577)
	at hudson.plugins.git.GitSCM.compareRemoteRevisionWith(GitSCM.java:527)
	at hudson.scm.SCM.compareRemoteRevisionWith(SCM.java:381)
	at hudson.scm.SCM.poll(SCM.java:398)
	at hudson.model.AbstractProject._poll(AbstractProject.java:1453)
	at hudson.model.AbstractProject.poll(AbstractProject.java:1356)
	at hudson.triggers.SCMTrigger$Runner.runPolling(SCMTrigger.java:526)
	at hudson.triggers.SCMTrigger$Runner.run(SCMTrigger.java:555)
	at hudson.util.SequentialExecutionQueue$QueueEntry.run(SequentialExecutionQueue.java:119)
	at java.util.concurrent.Executors$RunnableAdapter.call(Executors.java:471)
	at java.util.concurrent.FutureTask.run(FutureTask.java:262)
	at java.util.concurrent.ThreadPoolExecutor.runWorker(ThreadPoolExecutor.java:1145)
	at java.util.concurrent.ThreadPoolExecutor$Worker.run(ThreadPoolExecutor.java:615)
	at java.lang.Thread.run(Thread.java:745)
Tests run: 3, Failures: 0, Errors: 0, Skipped: 0, Time elapsed: 8.227 sec - in org.apache.hadoop.hdfs.TestRead
Running org.apache.hadoop.hdfs.shortcircuit.TestShortCircuitLocalRead
Tests run: 11, Failures: 0, Errors: 0, Skipped: 0, Time elapsed: 13.418 sec - in org.apache.hadoop.hdfs.shortcircuit.TestShortCircuitCache
Running org.apache.hadoop.hdfs.TestMultiThreadedHflush
Tests run: 3, Failures: 0, Errors: 0, Skipped: 0, Time elapsed: 9.765 sec - in org.apache.hadoop.hdfs.TestMultiThreadedHflush
Running org.apache.hadoop.hdfs.TestReconstructStripedFile
Tests run: 11, Failures: 0, Errors: 0, Skipped: 0, Time elapsed: 18.744 sec - in org.apache.hadoop.hdfs.shortcircuit.TestShortCircuitLocalRead
Running org.apache.hadoop.hdfs.TestSafeModeWithStripedFile
Tests run: 9, Failures: 0, Errors: 0, Skipped: 0, Time elapsed: 62.409 sec - in org.apache.hadoop.hdfs.TestAclsEndToEnd
Running org.apache.hadoop.hdfs.TestEncryptionZonesWithKMS
Tests run: 3, Failures: 0, Errors: 0, Skipped: 0, Time elapsed: 44.183 sec - in org.apache.hadoop.hdfs.TestGetBlocks
Running org.apache.hadoop.hdfs.TestFileLengthOnClusterRestart
Tests run: 1, Failures: 0, Errors: 0, Skipped: 0, Time elapsed: 11.276 sec - in org.apache.hadoop.hdfs.TestFileLengthOnClusterRestart
Running org.apache.hadoop.hdfs.TestBlockMissingException
Tests run: 2, Failures: 0, Errors: 0, Skipped: 0, Time elapsed: 28.814 sec - in org.apache.hadoop.hdfs.TestSafeModeWithStripedFile
Running org.apache.hadoop.hdfs.TestReplication
Tests run: 1, Failures: 0, Errors: 0, Skipped: 0, Time elapsed: 5.214 sec - in org.apache.hadoop.hdfs.TestBlockMissingException
Running org.apache.hadoop.hdfs.TestDFSStripedOutputStreamWithFailure090
Tests run: 10, Failures: 0, Errors: 0, Skipped: 0, Time elapsed: 0.402 sec - in org.apache.hadoop.hdfs.TestDFSStripedOutputStreamWithFailure090
Running org.apache.hadoop.hdfs.TestFileAppend
Tests run: 12, Failures: 0, Errors: 0, Skipped: 0, Time elapsed: 36.721 sec - in org.apache.hadoop.hdfs.TestFileAppend
Running org.apache.hadoop.hdfs.TestDistributedFileSystem
Tests run: 13, Failures: 0, Errors: 0, Skipped: 0, Time elapsed: 81.643 sec - in org.apache.hadoop.hdfs.TestReconstructStripedFile
Running org.apache.hadoop.hdfs.TestDFSStripedOutputStreamWithFailure160
Tests run: 10, Failures: 0, Errors: 0, Skipped: 0, Time elapsed: 0.353 sec - in org.apache.hadoop.hdfs.TestDFSStripedOutputStreamWithFailure160
Running org.apache.hadoop.hdfs.TestReservedRawPaths
Tests run: 9, Failures: 0, Errors: 0, Skipped: 0, Time elapsed: 52.487 sec - in org.apache.hadoop.hdfs.TestReplication
Running org.apache.hadoop.hdfs.TestMissingBlocksAlert
Tests run: 1, Failures: 0, Errors: 0, Skipped: 0, Time elapsed: 5.879 sec - in org.apache.hadoop.hdfs.TestMissingBlocksAlert
Running org.apache.hadoop.hdfs.TestClose
Tests run: 8, Failures: 0, Errors: 0, Skipped: 0, Time elapsed: 10.674 sec - in org.apache.hadoop.hdfs.TestReservedRawPaths
Running org.apache.hadoop.hdfs.TestDFSStripedOutputStreamWithFailure120
Tests run: 28, Failures: 0, Errors: 0, Skipped: 0, Time elapsed: 83.457 sec - in org.apache.hadoop.hdfs.TestEncryptionZonesWithKMS
Running org.apache.hadoop.hdfs.TestFileConcurrentReader
Tests run: 1, Failures: 0, Errors: 0, Skipped: 0, Time elapsed: 4.802 sec - in org.apache.hadoop.hdfs.TestClose
Running org.apache.hadoop.hdfs.TestHDFSServerPorts
Tests run: 4, Failures: 0, Errors: 0, Skipped: 0, Time elapsed: 7.701 sec - in org.apache.hadoop.hdfs.TestHDFSServerPorts
Running org.apache.hadoop.tracing.TestTracing
Tests run: 1, Failures: 0, Errors: 0, Skipped: 0, Time elapsed: 6.595 sec - in org.apache.hadoop.tracing.TestTracing
Running org.apache.hadoop.tracing.TestTraceAdmin
Tests run: 7, Failures: 0, Errors: 0, Skipped: 0, Time elapsed: 22.333 sec - in org.apache.hadoop.hdfs.TestFileConcurrentReader
Running org.apache.hadoop.tracing.TestTracingShortCircuitLocalRead
Tests run: 2, Failures: 0, Errors: 0, Skipped: 0, Time elapsed: 7.915 sec - in org.apache.hadoop.tracing.TestTraceAdmin
Tests run: 1, Failures: 0, Errors: 0, Skipped: 0, Time elapsed: 5.07 sec - in org.apache.hadoop.tracing.TestTracingShortCircuitLocalRead
Tests run: 24, Failures: 0, Errors: 0, Skipped: 0, Time elapsed: 52.94 sec - in org.apache.hadoop.hdfs.TestDistributedFileSystem
Tests run: 10, Failures: 0, Errors: 0, Skipped: 0, Time elapsed: 42.807 sec - in org.apache.hadoop.hdfs.TestDFSStripedOutputStreamWithFailure120

Results :

Failed tests: 
  TestDataNodeErasureCodingMetrics.testEcTasks:108 Bad value for metric EcReconstructionTasks
expected:<1> but was:<0>

Tests run: 4435, Failures: 1, Errors: 0, Skipped: 17

[INFO]                                                                         
[INFO] ------------------------------------------------------------------------
[INFO] Skipping Apache Hadoop HDFS Native Client
[INFO] This project has been banned from the build due to previous failures.
[INFO] ------------------------------------------------------------------------
[INFO]                                                                         
[INFO] ------------------------------------------------------------------------
[INFO] Skipping Apache Hadoop HttpFS
[INFO] This project has been banned from the build due to previous failures.
[INFO] ------------------------------------------------------------------------
[INFO]                                                                         
[INFO] ------------------------------------------------------------------------
[INFO] Skipping Apache Hadoop HDFS BookKeeper Journal
[INFO] This project has been banned from the build due to previous failures.
[INFO] ------------------------------------------------------------------------
[INFO]                                                                         
[INFO] ------------------------------------------------------------------------
[INFO] Skipping Apache Hadoop HDFS-NFS
[INFO] This project has been banned from the build due to previous failures.
[INFO] ------------------------------------------------------------------------
[INFO]                                                                         
[INFO] ------------------------------------------------------------------------
[INFO] Building Apache Hadoop HDFS Project 3.0.0-alpha1-SNAPSHOT
[INFO] ------------------------------------------------------------------------
[INFO] 
[INFO] --- maven-clean-plugin:2.5:clean (default-clean) @ hadoop-hdfs-project ---
[INFO] Deleting <https://builds.apache.org/job/Hadoop-Hdfs-trunk-Java8/ws/source/hadoop-hdfs-project/target>
[INFO] 
[INFO] --- maven-antrun-plugin:1.7:run (create-testdirs) @ hadoop-hdfs-project ---
[INFO] Executing tasks

main:
    [mkdir] Created dir: <https://builds.apache.org/job/Hadoop-Hdfs-trunk-Java8/ws/source/hadoop-hdfs-project/target/test-dir>
[INFO] Executed tasks
[INFO] 
[INFO] --- maven-source-plugin:2.3:jar-no-fork (hadoop-java-sources) @ hadoop-hdfs-project
---
[INFO] 
[INFO] --- maven-source-plugin:2.3:test-jar-no-fork (hadoop-java-sources) @ hadoop-hdfs-project
---
[INFO] 
[INFO] --- maven-enforcer-plugin:1.3.1:enforce (dist-enforce) @ hadoop-hdfs-project ---
[INFO] 
[INFO] --- maven-site-plugin:3.5:attach-descriptor (attach-descriptor) @ hadoop-hdfs-project
---
[INFO] 
[INFO] --- maven-javadoc-plugin:2.8.1:jar (module-javadocs) @ hadoop-hdfs-project ---
[INFO] Not executing Javadoc as the project is not a Java classpath-capable package
[INFO] 
[INFO] --- maven-enforcer-plugin:1.3.1:enforce (depcheck) @ hadoop-hdfs-project ---
[INFO] 
[INFO] --- maven-checkstyle-plugin:2.15:checkstyle (default-cli) @ hadoop-hdfs-project ---
[INFO] 
[INFO] --- findbugs-maven-plugin:3.0.0:findbugs (default-cli) @ hadoop-hdfs-project ---
[INFO] ------------------------------------------------------------------------
[INFO] Reactor Summary:
[INFO] 
[INFO] Apache Hadoop HDFS Client .......................... SUCCESS [03:59 min]
[INFO] Apache Hadoop HDFS ................................. FAILURE [56:39 min]
[INFO] Apache Hadoop HDFS Native Client ................... SKIPPED
[INFO] Apache Hadoop HttpFS ............................... SKIPPED
[INFO] Apache Hadoop HDFS BookKeeper Journal .............. SKIPPED
[INFO] Apache Hadoop HDFS-NFS ............................. SKIPPED
[INFO] Apache Hadoop HDFS Project ......................... SUCCESS [  0.092 s]
[INFO] ------------------------------------------------------------------------
[INFO] BUILD FAILURE
[INFO] ------------------------------------------------------------------------
[INFO] Total time: 01:00 h
[INFO] Finished at: 2016-06-02T11:45:55+00:00
[INFO] Final Memory: 95M/3839M
[INFO] ------------------------------------------------------------------------
[ERROR] Failed to execute goal org.apache.maven.plugins:maven-surefire-plugin:2.17:test (default-test)
on project hadoop-hdfs: There are test failures.
[ERROR] 
[ERROR] Please refer to <https://builds.apache.org/job/Hadoop-Hdfs-trunk-Java8/ws/source/hadoop-hdfs-project/hadoop-hdfs/target/surefire-reports>
for the individual test results.
[ERROR] -> [Help 1]
[ERROR] 
[ERROR] To see the full stack trace of the errors, re-run Maven with the -e switch.
[ERROR] Re-run Maven using the -X switch to enable full debug logging.
[ERROR] 
[ERROR] For more information about the errors and possible solutions, please read the following
articles:
[ERROR] [Help 1] http://cwiki.apache.org/confluence/display/MAVEN/MojoFailureException
[ERROR] 
[ERROR] After correcting the problems, you can resume the build with the command
[ERROR]   mvn <goals> -rf :hadoop-hdfs
Build step 'Execute shell' marked build as failure
Archiving artifacts
Setting LATEST1_8_HOME=/home/jenkins/jenkins-slave/tools/hudson.model.JDK/latest1.8
Setting MAVEN_3_3_3_HOME=/home/jenkins/jenkins-slave/tools/hudson.tasks.Maven_MavenInstallation/maven-3.3.3
Recording test results
Setting LATEST1_8_HOME=/home/jenkins/jenkins-slave/tools/hudson.model.JDK/latest1.8
Setting MAVEN_3_3_3_HOME=/home/jenkins/jenkins-slave/tools/hudson.tasks.Maven_MavenInstallation/maven-3.3.3
Setting LATEST1_8_HOME=/home/jenkins/jenkins-slave/tools/hudson.model.JDK/latest1.8
Setting MAVEN_3_3_3_HOME=/home/jenkins/jenkins-slave/tools/hudson.tasks.Maven_MavenInstallation/maven-3.3.3

---------------------------------------------------------------------
To unsubscribe, e-mail: hdfs-dev-unsubscribe@hadoop.apache.org
For additional commands, e-mail: hdfs-dev-help@hadoop.apache.org


Mime
View raw message