hadoop-hdfs-dev mailing list archives

Site index · List index
Message view « Date » · « Thread »
Top « Date » · « Thread »
From Apache Jenkins Server <jenk...@builds.apache.org>
Subject Hadoop-Hdfs-trunk-Java8 - Build # 1330 - Still Failing
Date Fri, 10 Jun 2016 11:57:28 GMT
See https://builds.apache.org/job/Hadoop-Hdfs-trunk-Java8/1330/

###################################################################################
########################## LAST 60 LINES OF THE CONSOLE ###########################
[...truncated 7126 lines...]
[INFO] 
[INFO] --- maven-enforcer-plugin:1.3.1:enforce (dist-enforce) @ hadoop-hdfs-project ---
[INFO] 
[INFO] --- maven-site-plugin:3.5:attach-descriptor (attach-descriptor) @ hadoop-hdfs-project
---
[INFO] 
[INFO] --- maven-javadoc-plugin:2.8.1:jar (module-javadocs) @ hadoop-hdfs-project ---
[INFO] Not executing Javadoc as the project is not a Java classpath-capable package
[INFO] 
[INFO] --- maven-enforcer-plugin:1.3.1:enforce (depcheck) @ hadoop-hdfs-project ---
[INFO] 
[INFO] --- maven-checkstyle-plugin:2.15:checkstyle (default-cli) @ hadoop-hdfs-project ---
[INFO] 
[INFO] --- findbugs-maven-plugin:3.0.0:findbugs (default-cli) @ hadoop-hdfs-project ---
[INFO] ------------------------------------------------------------------------
[INFO] Reactor Summary:
[INFO] 
[INFO] Apache Hadoop HDFS Client .......................... SUCCESS [04:06 min]
[INFO] Apache Hadoop HDFS ................................. FAILURE [  01:07 h]
[INFO] Apache Hadoop HDFS Native Client ................... SKIPPED
[INFO] Apache Hadoop HttpFS ............................... SKIPPED
[INFO] Apache Hadoop HDFS BookKeeper Journal .............. SKIPPED
[INFO] Apache Hadoop HDFS-NFS ............................. SKIPPED
[INFO] Apache Hadoop HDFS Project ......................... SUCCESS [  0.618 s]
[INFO] ------------------------------------------------------------------------
[INFO] BUILD FAILURE
[INFO] ------------------------------------------------------------------------
[INFO] Total time: 01:11 h
[INFO] Finished at: 2016-06-10T11:57:11+00:00
[INFO] Final Memory: 104M/3607M
[INFO] ------------------------------------------------------------------------
[ERROR] Failed to execute goal org.apache.maven.plugins:maven-surefire-plugin:2.17:test (default-test)
on project hadoop-hdfs: There are test failures.
[ERROR] 
[ERROR] Please refer to /home/jenkins/jenkins-slave/workspace/Hadoop-Hdfs-trunk-Java8/source/hadoop-hdfs-project/hadoop-hdfs/target/surefire-reports
for the individual test results.
[ERROR] -> [Help 1]
[ERROR] 
[ERROR] To see the full stack trace of the errors, re-run Maven with the -e switch.
[ERROR] Re-run Maven using the -X switch to enable full debug logging.
[ERROR] 
[ERROR] For more information about the errors and possible solutions, please read the following
articles:
[ERROR] [Help 1] http://cwiki.apache.org/confluence/display/MAVEN/MojoFailureException
[ERROR] 
[ERROR] After correcting the problems, you can resume the build with the command
[ERROR]   mvn <goals> -rf :hadoop-hdfs
Build step 'Execute shell' marked build as failure
Archiving artifacts
Setting LATEST1_8_HOME=/home/jenkins/jenkins-slave/tools/hudson.model.JDK/latest1.8
Setting MAVEN_3_3_3_HOME=/home/jenkins/jenkins-slave/tools/hudson.tasks.Maven_MavenInstallation/maven-3.3.3
Recording test results
Setting LATEST1_8_HOME=/home/jenkins/jenkins-slave/tools/hudson.model.JDK/latest1.8
Setting MAVEN_3_3_3_HOME=/home/jenkins/jenkins-slave/tools/hudson.tasks.Maven_MavenInstallation/maven-3.3.3
Setting LATEST1_8_HOME=/home/jenkins/jenkins-slave/tools/hudson.model.JDK/latest1.8
Setting MAVEN_3_3_3_HOME=/home/jenkins/jenkins-slave/tools/hudson.tasks.Maven_MavenInstallation/maven-3.3.3
Sending e-mails to: hdfs-dev@hadoop.apache.org
Email was triggered for: Failure - Any
Sending email for trigger: Failure - Any
Setting LATEST1_8_HOME=/home/jenkins/jenkins-slave/tools/hudson.model.JDK/latest1.8
Setting MAVEN_3_3_3_HOME=/home/jenkins/jenkins-slave/tools/hudson.tasks.Maven_MavenInstallation/maven-3.3.3
Setting LATEST1_8_HOME=/home/jenkins/jenkins-slave/tools/hudson.model.JDK/latest1.8
Setting MAVEN_3_3_3_HOME=/home/jenkins/jenkins-slave/tools/hudson.tasks.Maven_MavenInstallation/maven-3.3.3



###################################################################################
############################## FAILED TESTS (if any) ##############################
2 tests failed.
FAILED:  org.apache.hadoop.hdfs.server.datanode.TestDataNodeErasureCodingMetrics.testEcTasks

Error Message:
Bad value for metric EcReconstructionTasks expected:<1> but was:<0>

Stack Trace:
java.lang.AssertionError: Bad value for metric EcReconstructionTasks expected:<1> but
was:<0>
	at org.junit.Assert.fail(Assert.java:88)
	at org.junit.Assert.failNotEquals(Assert.java:743)
	at org.junit.Assert.assertEquals(Assert.java:118)
	at org.junit.Assert.assertEquals(Assert.java:555)
	at org.apache.hadoop.test.MetricsAsserts.assertCounter(MetricsAsserts.java:228)
	at org.apache.hadoop.hdfs.server.datanode.TestDataNodeErasureCodingMetrics.testEcTasks(TestDataNodeErasureCodingMetrics.java:108)


FAILED:  org.apache.hadoop.hdfs.server.namenode.snapshot.TestSnapshotFileLength.testSnapshotfileLength

Error Message:
Fail to get block MD5 for LocatedBlock{BP-899719433-67.195.81.149-1465556874023:blk_1073741826_1002;
getBlockSize()=1; corrupt=false; offset=1024; locs=[DatanodeInfoWithStorage[127.0.0.1:60393,DS-0ab9f2c7-1963-4a29-aac2-2b441b40c9f0,DISK]]}

Stack Trace:
java.io.IOException: Fail to get block MD5 for LocatedBlock{BP-899719433-67.195.81.149-1465556874023:blk_1073741826_1002;
getBlockSize()=1; corrupt=false; offset=1024; locs=[DatanodeInfoWithStorage[127.0.0.1:60393,DS-0ab9f2c7-1963-4a29-aac2-2b441b40c9f0,DISK]]}
	at org.apache.hadoop.hdfs.FileChecksumHelper$ReplicatedFileChecksumComputer.checksumBlocks(FileChecksumHelper.java:289)
	at org.apache.hadoop.hdfs.FileChecksumHelper$FileChecksumComputer.compute(FileChecksumHelper.java:206)
	at org.apache.hadoop.hdfs.DFSClient.getFileChecksum(DFSClient.java:1731)
	at org.apache.hadoop.hdfs.DistributedFileSystem$31.doCall(DistributedFileSystem.java:1482)
	at org.apache.hadoop.hdfs.DistributedFileSystem$31.doCall(DistributedFileSystem.java:1479)
	at org.apache.hadoop.fs.FileSystemLinkResolver.resolve(FileSystemLinkResolver.java:81)
	at org.apache.hadoop.hdfs.DistributedFileSystem.getFileChecksum(DistributedFileSystem.java:1490)
	at org.apache.hadoop.hdfs.server.namenode.snapshot.TestSnapshotFileLength.testSnapshotfileLength(TestSnapshotFileLength.java:137)




Mime
View raw message