hadoop-hdfs-dev mailing list archives

Site index · List index
Message view « Date » · « Thread »
Top « Date » · « Thread »
From Apache Jenkins Server <jenk...@builds.apache.org>
Subject Build failed in Jenkins: Hadoop-Hdfs-trunk-Java8 #1338
Date Mon, 13 Jun 2016 06:59:21 GMT
See <https://builds.apache.org/job/Hadoop-Hdfs-trunk-Java8/1338/changes>

Changes:

[rohithsharmaks] YARN-4989. TestWorkPreservingRMRestart#testCapacitySchedulerRecovery

------------------------------------------
[...truncated 7197 lines...]
Running org.apache.hadoop.hdfs.TestDFSStripedOutputStreamWithFailure040
Tests run: 10, Failures: 0, Errors: 0, Skipped: 0, Time elapsed: 0.377 sec - in org.apache.hadoop.hdfs.TestDFSStripedOutputStreamWithFailure040
Running org.apache.hadoop.hdfs.TestDFSAddressConfig
Tests run: 1, Failures: 0, Errors: 0, Skipped: 0, Time elapsed: 5.798 sec - in org.apache.hadoop.hdfs.TestClose
Running org.apache.hadoop.hdfs.TestDFSStripedOutputStreamWithFailure170
Tests run: 10, Failures: 0, Errors: 0, Skipped: 0, Time elapsed: 0.49 sec - in org.apache.hadoop.hdfs.TestDFSStripedOutputStreamWithFailure170
Running org.apache.hadoop.hdfs.TestParallelShortCircuitLegacyRead
Tests run: 1, Failures: 0, Errors: 0, Skipped: 0, Time elapsed: 7.028 sec - in org.apache.hadoop.hdfs.TestDFSAddressConfig
Running org.apache.hadoop.hdfs.TestLargeBlock
Tests run: 4, Failures: 0, Errors: 0, Skipped: 0, Time elapsed: 38.924 sec - in org.apache.hadoop.hdfs.TestFileAppend4
Running org.apache.hadoop.hdfs.TestHDFSTrash
Tests run: 4, Failures: 0, Errors: 0, Skipped: 0, Time elapsed: 41.101 sec - in org.apache.hadoop.hdfs.TestParallelRead
Running org.apache.hadoop.hdfs.TestClientReportBadBlock
Tests run: 2, Failures: 0, Errors: 0, Skipped: 0, Time elapsed: 7.895 sec - in org.apache.hadoop.hdfs.TestHDFSTrash
Running org.apache.hadoop.hdfs.TestWriteRead
Tests run: 4, Failures: 0, Errors: 0, Skipped: 0, Time elapsed: 18.714 sec - in org.apache.hadoop.hdfs.TestParallelShortCircuitLegacyRead
Running org.apache.hadoop.hdfs.TestClientProtocolForPipelineRecovery
Tests run: 1, Failures: 0, Errors: 0, Skipped: 0, Time elapsed: 21.183 sec - in org.apache.hadoop.hdfs.TestLargeBlock
Running org.apache.hadoop.hdfs.TestBalancerBandwidth
Tests run: 3, Failures: 0, Errors: 0, Skipped: 0, Time elapsed: 13.583 sec - in org.apache.hadoop.hdfs.TestClientReportBadBlock
Running org.apache.hadoop.hdfs.TestDFSUpgrade
Tests run: 1, Failures: 0, Errors: 0, Skipped: 0, Time elapsed: 22.604 sec - in org.apache.hadoop.hdfs.TestBalancerBandwidth
Running org.apache.hadoop.hdfs.TestBlockStoragePolicy
Tests run: 2, Failures: 0, Errors: 0, Skipped: 0, Time elapsed: 24.867 sec - in org.apache.hadoop.hdfs.TestDFSUpgrade
Running org.apache.hadoop.hdfs.TestFileLengthOnClusterRestart
Tests run: 3, Failures: 0, Errors: 0, Skipped: 0, Time elapsed: 36.231 sec - in org.apache.hadoop.hdfs.TestWriteRead
Running org.apache.hadoop.hdfs.TestLeaseRecoveryStriped
Tests run: 1, Failures: 0, Errors: 0, Skipped: 0, Time elapsed: 11.198 sec - in org.apache.hadoop.hdfs.TestFileLengthOnClusterRestart
Running org.apache.hadoop.hdfs.client.impl.TestBlockReaderLocal
Tests run: 8, Failures: 0, Errors: 0, Skipped: 0, Time elapsed: 69.759 sec - in org.apache.hadoop.hdfs.TestClientProtocolForPipelineRecovery
Running org.apache.hadoop.hdfs.client.impl.TestBlockReaderLocalLegacy
Tests run: 1, Failures: 0, Errors: 0, Skipped: 0, Time elapsed: 37.428 sec - in org.apache.hadoop.hdfs.TestLeaseRecoveryStriped
Running org.apache.hadoop.hdfs.client.impl.TestBlockReaderRemote2
Tests run: 20, Failures: 0, Errors: 0, Skipped: 0, Time elapsed: 50.866 sec - in org.apache.hadoop.hdfs.TestBlockStoragePolicy
Tests run: 1, Failures: 0, Errors: 0, Skipped: 0, Time elapsed: 5.647 sec - in org.apache.hadoop.hdfs.client.impl.TestBlockReaderRemote2
Running org.apache.hadoop.hdfs.client.impl.TestClientBlockVerification
Running org.apache.hadoop.hdfs.client.impl.TestBlockReaderRemote
Tests run: 3, Failures: 0, Errors: 0, Skipped: 0, Time elapsed: 10.135 sec - in org.apache.hadoop.hdfs.client.impl.TestBlockReaderLocalLegacy
Running org.apache.hadoop.hdfs.client.impl.TestBlockReaderFactory
Tests run: 1, Failures: 0, Errors: 0, Skipped: 0, Time elapsed: 5.921 sec - in org.apache.hadoop.hdfs.client.impl.TestBlockReaderRemote
Tests run: 4, Failures: 0, Errors: 0, Skipped: 0, Time elapsed: 6.231 sec - in org.apache.hadoop.hdfs.client.impl.TestClientBlockVerification
Running org.apache.hadoop.hdfs.qjournal.TestSecureNNWithQJM
Running org.apache.hadoop.hdfs.qjournal.TestNNWithQJM
Tests run: 3, Failures: 0, Errors: 0, Skipped: 0, Time elapsed: 11.088 sec - in org.apache.hadoop.hdfs.qjournal.TestNNWithQJM
Running org.apache.hadoop.hdfs.qjournal.server.TestJournalNodeMXBean
Tests run: 7, Failures: 0, Errors: 0, Skipped: 0, Time elapsed: 19.194 sec - in org.apache.hadoop.hdfs.client.impl.TestBlockReaderFactory
Tests run: 1, Failures: 0, Errors: 0, Skipped: 0, Time elapsed: 2.535 sec - in org.apache.hadoop.hdfs.qjournal.server.TestJournalNodeMXBean
Running org.apache.hadoop.hdfs.qjournal.server.TestJournal
Running org.apache.hadoop.hdfs.qjournal.server.TestJournalNode
Tests run: 12, Failures: 0, Errors: 0, Skipped: 0, Time elapsed: 4.242 sec - in org.apache.hadoop.hdfs.qjournal.server.TestJournal
Running org.apache.hadoop.hdfs.qjournal.client.TestIPCLoggerChannel
Tests run: 3, Failures: 0, Errors: 0, Skipped: 0, Time elapsed: 0.962 sec - in org.apache.hadoop.hdfs.qjournal.client.TestIPCLoggerChannel
Running org.apache.hadoop.hdfs.qjournal.client.TestQJMWithFaults
Tests run: 37, Failures: 0, Errors: 0, Skipped: 0, Time elapsed: 67.379 sec - in org.apache.hadoop.hdfs.client.impl.TestBlockReaderLocal
Running org.apache.hadoop.hdfs.qjournal.client.TestEpochsAreUnique
Tests run: 2, Failures: 0, Errors: 0, Skipped: 0, Time elapsed: 36.334 sec - in org.apache.hadoop.hdfs.qjournal.TestSecureNNWithQJM
Tests run: 6, Failures: 0, Errors: 0, Skipped: 0, Time elapsed: 21.553 sec - in org.apache.hadoop.hdfs.qjournal.server.TestJournalNode
Running org.apache.hadoop.hdfs.qjournal.client.TestQuorumJournalManagerUnit
Tests run: 1, Failures: 0, Errors: 0, Skipped: 0, Time elapsed: 9.759 sec - in org.apache.hadoop.hdfs.qjournal.client.TestEpochsAreUnique
Running org.apache.hadoop.hdfs.qjournal.client.TestSegmentRecoveryComparator
Tests run: 1, Failures: 0, Errors: 0, Skipped: 0, Time elapsed: 0.241 sec - in org.apache.hadoop.hdfs.qjournal.client.TestSegmentRecoveryComparator
Running org.apache.hadoop.hdfs.qjournal.client.TestQuorumCall
Tests run: 1, Failures: 0, Errors: 0, Skipped: 0, Time elapsed: 0.258 sec - in org.apache.hadoop.hdfs.qjournal.client.TestQuorumCall
Running org.apache.hadoop.hdfs.qjournal.client.TestQuorumJournalManager
Running org.apache.hadoop.hdfs.qjournal.TestMiniJournalCluster
Tests run: 6, Failures: 0, Errors: 0, Skipped: 0, Time elapsed: 1.553 sec - in org.apache.hadoop.hdfs.qjournal.client.TestQuorumJournalManagerUnit
Running org.apache.hadoop.hdfs.TestAsyncDFSRename
Tests run: 1, Failures: 0, Errors: 0, Skipped: 0, Time elapsed: 2.924 sec - in org.apache.hadoop.hdfs.qjournal.TestMiniJournalCluster
Running org.apache.hadoop.hdfs.TestFileCreationEmpty
Tests run: 1, Failures: 0, Errors: 0, Skipped: 0, Time elapsed: 10.812 sec - in org.apache.hadoop.hdfs.TestFileCreationEmpty
Running org.apache.hadoop.hdfs.TestDFSStripedOutputStreamWithFailure200
Tests run: 10, Failures: 0, Errors: 0, Skipped: 0, Time elapsed: 0.343 sec - in org.apache.hadoop.hdfs.TestDFSStripedOutputStreamWithFailure200
Running org.apache.hadoop.hdfs.TestBlockMissingException
Tests run: 1, Failures: 0, Errors: 0, Skipped: 0, Time elapsed: 6.046 sec - in org.apache.hadoop.hdfs.TestBlockMissingException
Running org.apache.hadoop.hdfs.TestDataTransferKeepalive
Tests run: 2, Failures: 0, Errors: 0, Skipped: 0, Time elapsed: 34.098 sec - in org.apache.hadoop.hdfs.TestAsyncDFSRename
Running org.apache.hadoop.hdfs.TestModTime
Tests run: 4, Failures: 0, Errors: 0, Skipped: 0, Time elapsed: 21.522 sec - in org.apache.hadoop.hdfs.TestDataTransferKeepalive
Running org.apache.hadoop.hdfs.TestDFSStripedOutputStreamWithFailure210
Tests run: 10, Failures: 0, Errors: 0, Skipped: 0, Time elapsed: 0.359 sec - in org.apache.hadoop.hdfs.TestDFSStripedOutputStreamWithFailure210
Running org.apache.hadoop.hdfs.TestRollingUpgradeDowngrade
Tests run: 21, Failures: 0, Errors: 0, Skipped: 0, Time elapsed: 50.14 sec - in org.apache.hadoop.hdfs.qjournal.client.TestQuorumJournalManager
Running org.apache.hadoop.hdfs.TestLease
Tests run: 2, Failures: 0, Errors: 0, Skipped: 0, Time elapsed: 14.907 sec - in org.apache.hadoop.hdfs.TestModTime
Running org.apache.hadoop.hdfs.TestParallelUnixDomainRead
Tests run: 2, Failures: 0, Errors: 0, Skipped: 0, Time elapsed: 9.515 sec - in org.apache.hadoop.hdfs.TestRollingUpgradeDowngrade
Running org.apache.hadoop.hdfs.TestDeprecatedKeys
Tests run: 1, Failures: 0, Errors: 0, Skipped: 0, Time elapsed: 0.562 sec - in org.apache.hadoop.hdfs.TestDeprecatedKeys
Running org.apache.hadoop.hdfs.TestFSOutputSummer
Tests run: 5, Failures: 0, Errors: 0, Skipped: 0, Time elapsed: 13.124 sec - in org.apache.hadoop.hdfs.TestLease
Running org.apache.hadoop.hdfs.TestRead
Tests run: 2, Failures: 0, Errors: 0, Skipped: 0, Time elapsed: 12.643 sec - in org.apache.hadoop.hdfs.TestFSOutputSummer
Running org.apache.hadoop.hdfs.TestFileStatusWithECPolicy
Tests run: 1, Failures: 0, Errors: 0, Skipped: 0, Time elapsed: 5.477 sec - in org.apache.hadoop.hdfs.TestFileStatusWithECPolicy
Running org.apache.hadoop.hdfs.TestDFSStripedOutputStreamWithFailure150
Tests run: 4, Failures: 0, Errors: 0, Skipped: 0, Time elapsed: 12.249 sec - in org.apache.hadoop.hdfs.TestRead
Running org.apache.hadoop.hdfs.TestHDFSPolicyProvider
Tests run: 3, Failures: 0, Errors: 0, Skipped: 0, Time elapsed: 0.207 sec - in org.apache.hadoop.hdfs.TestHDFSPolicyProvider
Running org.apache.hadoop.hdfs.TestAppendSnapshotTruncate
Tests run: 4, Failures: 0, Errors: 0, Skipped: 0, Time elapsed: 37.919 sec - in org.apache.hadoop.hdfs.TestParallelUnixDomainRead
Running org.apache.hadoop.hdfs.TestDFSInotifyEventInputStream
Tests run: 1, Failures: 0, Errors: 0, Skipped: 0, Time elapsed: 31.1 sec - in org.apache.hadoop.hdfs.TestAppendSnapshotTruncate
Running org.apache.hadoop.hdfs.TestDFSStripedOutputStreamWithFailure110
Tests run: 5, Failures: 0, Errors: 0, Skipped: 0, Time elapsed: 25.133 sec - in org.apache.hadoop.hdfs.TestDFSInotifyEventInputStream
Running org.apache.hadoop.hdfs.TestCrcCorruption
Tests run: 10, Failures: 0, Errors: 0, Skipped: 0, Time elapsed: 58.029 sec - in org.apache.hadoop.hdfs.TestDFSStripedOutputStreamWithFailure150
Running org.apache.hadoop.hdfs.TestGetBlocks
Tests run: 4, Failures: 0, Errors: 0, Skipped: 0, Time elapsed: 27.26 sec - in org.apache.hadoop.hdfs.TestCrcCorruption
Running org.apache.hadoop.hdfs.TestDFSStripedOutputStreamWithFailure020
Tests run: 3, Failures: 0, Errors: 0, Skipped: 0, Time elapsed: 47.199 sec - in org.apache.hadoop.hdfs.TestGetBlocks
Running org.apache.hadoop.hdfs.TestDecommissionWithStriped
Tests run: 10, Failures: 0, Errors: 0, Skipped: 0, Time elapsed: 49.443 sec - in org.apache.hadoop.hdfs.TestDFSStripedOutputStreamWithFailure020
Running org.apache.hadoop.hdfs.TestDataTransferProtocol
Tests run: 4, Failures: 0, Errors: 0, Skipped: 0, Time elapsed: 9.605 sec - in org.apache.hadoop.hdfs.TestDataTransferProtocol
Running org.apache.hadoop.hdfs.TestReadWhileWriting
Tests run: 10, Failures: 0, Errors: 0, Skipped: 0, Time elapsed: 101.76 sec - in org.apache.hadoop.hdfs.TestDFSStripedOutputStreamWithFailure110
Running org.apache.hadoop.hdfs.TestDFSStripedOutputStreamWithFailure
Tests run: 1, Failures: 0, Errors: 0, Skipped: 0, Time elapsed: 7.985 sec - in org.apache.hadoop.hdfs.TestReadWhileWriting
Running org.apache.hadoop.hdfs.TestKeyProviderCache
Tests run: 1, Failures: 0, Errors: 0, Skipped: 0, Time elapsed: 0.494 sec - in org.apache.hadoop.hdfs.TestKeyProviderCache
Running org.apache.hadoop.net.TestNetworkTopology
Tests run: 12, Failures: 0, Errors: 0, Skipped: 0, Time elapsed: 12.148 sec - in org.apache.hadoop.net.TestNetworkTopology
Running org.apache.hadoop.tracing.TestTraceAdmin
Tests run: 2, Failures: 0, Errors: 0, Skipped: 0, Time elapsed: 9.329 sec - in org.apache.hadoop.tracing.TestTraceAdmin
Running org.apache.hadoop.tracing.TestTracingShortCircuitLocalRead
Tests run: 1, Failures: 0, Errors: 0, Skipped: 0, Time elapsed: 6.421 sec - in org.apache.hadoop.tracing.TestTracingShortCircuitLocalRead
Running org.apache.hadoop.tracing.TestTracing
Tests run: 1, Failures: 0, Errors: 0, Skipped: 0, Time elapsed: 8.102 sec - in org.apache.hadoop.tracing.TestTracing
Running org.apache.hadoop.metrics2.sink.TestRollingFileSystemSinkWithHdfs
Tests run: 7, Failures: 0, Errors: 0, Skipped: 0, Time elapsed: 75.063 sec - in org.apache.hadoop.hdfs.TestDecommissionWithStriped
Running org.apache.hadoop.metrics2.sink.TestRollingFileSystemSinkWithSecureHdfs
Tests run: 2, Failures: 0, Errors: 0, Skipped: 0, Time elapsed: 12.84 sec - in org.apache.hadoop.metrics2.sink.TestRollingFileSystemSinkWithSecureHdfs
Running org.apache.hadoop.TestRefreshCallQueue
Tests run: 1, Failures: 0, Errors: 0, Skipped: 0, Time elapsed: 6.006 sec - in org.apache.hadoop.TestRefreshCallQueue
Tests run: 11, Failures: 0, Errors: 0, Skipped: 0, Time elapsed: 54.139 sec - in org.apache.hadoop.metrics2.sink.TestRollingFileSystemSinkWithHdfs
Tests run: 2, Failures: 0, Errors: 0, Skipped: 0, Time elapsed: 349.968 sec - in org.apache.hadoop.hdfs.qjournal.client.TestQJMWithFaults
Tests run: 4, Failures: 0, Errors: 0, Skipped: 0, Time elapsed: 124.74 sec - in org.apache.hadoop.hdfs.TestDFSStripedOutputStreamWithFailure

Results :

Failed tests: 
  TestRBWBlockInvalidation.testRWRInvalidation:226 expected:<[old gs data
new gs data
]> but was:<[]>

Tests in error: 
  TestOpenFilesWithSnapshot.testParentDirWithUCFileDeleteWithSnapShot:82 » IO Ti...
  TestRBWBlockInvalidation.testBlockInvalidationWhenRBWReplicaMissedInDN:121 »  ...

Tests run: 4435, Failures: 1, Errors: 2, Skipped: 17

[INFO]                                                                         
[INFO] ------------------------------------------------------------------------
[INFO] Skipping Apache Hadoop HDFS Native Client
[INFO] This project has been banned from the build due to previous failures.
[INFO] ------------------------------------------------------------------------
[INFO]                                                                         
[INFO] ------------------------------------------------------------------------
[INFO] Skipping Apache Hadoop HttpFS
[INFO] This project has been banned from the build due to previous failures.
[INFO] ------------------------------------------------------------------------
[INFO]                                                                         
[INFO] ------------------------------------------------------------------------
[INFO] Skipping Apache Hadoop HDFS BookKeeper Journal
[INFO] This project has been banned from the build due to previous failures.
[INFO] ------------------------------------------------------------------------
[INFO]                                                                         
[INFO] ------------------------------------------------------------------------
[INFO] Skipping Apache Hadoop HDFS-NFS
[INFO] This project has been banned from the build due to previous failures.
[INFO] ------------------------------------------------------------------------
[INFO]                                                                         
[INFO] ------------------------------------------------------------------------
[INFO] Building Apache Hadoop HDFS Project 3.0.0-alpha1-SNAPSHOT
[INFO] ------------------------------------------------------------------------
[INFO] 
[INFO] --- maven-clean-plugin:2.5:clean (default-clean) @ hadoop-hdfs-project ---
[INFO] Deleting <https://builds.apache.org/job/Hadoop-Hdfs-trunk-Java8/ws/source/hadoop-hdfs-project/target>
[INFO] 
[INFO] --- maven-antrun-plugin:1.7:run (create-testdirs) @ hadoop-hdfs-project ---
[INFO] Executing tasks

main:
    [mkdir] Created dir: <https://builds.apache.org/job/Hadoop-Hdfs-trunk-Java8/ws/source/hadoop-hdfs-project/target/test-dir>
[INFO] Executed tasks
[INFO] 
[INFO] --- maven-remote-resources-plugin:1.5:process (default) @ hadoop-hdfs-project ---
[INFO] 
[INFO] --- maven-antrun-plugin:1.7:run (copy-files) @ hadoop-hdfs-project ---
[INFO] Executing tasks

main:
[INFO] Executed tasks
[INFO] 
[INFO] --- maven-source-plugin:2.3:jar-no-fork (hadoop-java-sources) @ hadoop-hdfs-project
---
[INFO] 
[INFO] --- maven-source-plugin:2.3:test-jar-no-fork (hadoop-java-sources) @ hadoop-hdfs-project
---
[INFO] 
[INFO] --- maven-enforcer-plugin:1.3.1:enforce (dist-enforce) @ hadoop-hdfs-project ---
[INFO] 
[INFO] --- maven-site-plugin:3.5:attach-descriptor (attach-descriptor) @ hadoop-hdfs-project
---
[INFO] 
[INFO] --- maven-javadoc-plugin:2.8.1:jar (module-javadocs) @ hadoop-hdfs-project ---
[INFO] Not executing Javadoc as the project is not a Java classpath-capable package
[INFO] 
[INFO] --- maven-enforcer-plugin:1.3.1:enforce (depcheck) @ hadoop-hdfs-project ---
[INFO] 
[INFO] --- maven-checkstyle-plugin:2.15:checkstyle (default-cli) @ hadoop-hdfs-project ---
[INFO] 
[INFO] --- findbugs-maven-plugin:3.0.0:findbugs (default-cli) @ hadoop-hdfs-project ---
[INFO] ------------------------------------------------------------------------
[INFO] Reactor Summary:
[INFO] 
[INFO] Apache Hadoop HDFS Client .......................... SUCCESS [04:00 min]
[INFO] Apache Hadoop HDFS ................................. FAILURE [  01:09 h]
[INFO] Apache Hadoop HDFS Native Client ................... SKIPPED
[INFO] Apache Hadoop HttpFS ............................... SKIPPED
[INFO] Apache Hadoop HDFS BookKeeper Journal .............. SKIPPED
[INFO] Apache Hadoop HDFS-NFS ............................. SKIPPED
[INFO] Apache Hadoop HDFS Project ......................... SUCCESS [  0.524 s]
[INFO] ------------------------------------------------------------------------
[INFO] BUILD FAILURE
[INFO] ------------------------------------------------------------------------
[INFO] Total time: 01:13 h
[INFO] Finished at: 2016-06-13T06:58:58+00:00
[INFO] Final Memory: 100M/4397M
[INFO] ------------------------------------------------------------------------
[ERROR] Failed to execute goal org.apache.maven.plugins:maven-surefire-plugin:2.17:test (default-test)
on project hadoop-hdfs: There are test failures.
[ERROR] 
[ERROR] Please refer to <https://builds.apache.org/job/Hadoop-Hdfs-trunk-Java8/ws/source/hadoop-hdfs-project/hadoop-hdfs/target/surefire-reports>
for the individual test results.
[ERROR] -> [Help 1]
[ERROR] 
[ERROR] To see the full stack trace of the errors, re-run Maven with the -e switch.
[ERROR] Re-run Maven using the -X switch to enable full debug logging.
[ERROR] 
[ERROR] For more information about the errors and possible solutions, please read the following
articles:
[ERROR] [Help 1] http://cwiki.apache.org/confluence/display/MAVEN/MojoFailureException
[ERROR] 
[ERROR] After correcting the problems, you can resume the build with the command
[ERROR]   mvn <goals> -rf :hadoop-hdfs
Build step 'Execute shell' marked build as failure
Archiving artifacts
Setting LATEST1_8_HOME=/home/jenkins/jenkins-slave/tools/hudson.model.JDK/latest1.8
Setting MAVEN_3_3_3_HOME=/home/jenkins/jenkins-slave/tools/hudson.tasks.Maven_MavenInstallation/maven-3.3.3
Recording test results
Setting LATEST1_8_HOME=/home/jenkins/jenkins-slave/tools/hudson.model.JDK/latest1.8
Setting MAVEN_3_3_3_HOME=/home/jenkins/jenkins-slave/tools/hudson.tasks.Maven_MavenInstallation/maven-3.3.3
Setting LATEST1_8_HOME=/home/jenkins/jenkins-slave/tools/hudson.model.JDK/latest1.8
Setting MAVEN_3_3_3_HOME=/home/jenkins/jenkins-slave/tools/hudson.tasks.Maven_MavenInstallation/maven-3.3.3

---------------------------------------------------------------------
To unsubscribe, e-mail: hdfs-dev-unsubscribe@hadoop.apache.org
For additional commands, e-mail: hdfs-dev-help@hadoop.apache.org


Mime
View raw message