hadoop-hdfs-dev mailing list archives

Site index · List index
Message view « Date » · « Thread »
Top « Date » · « Thread »
From Apache Jenkins Server <jenk...@builds.apache.org>
Subject Hadoop-Hdfs-trunk - Build # 3110 - Still Failing
Date Fri, 06 May 2016 01:20:15 GMT
See https://builds.apache.org/job/Hadoop-Hdfs-trunk/3110/

###################################################################################
########################## LAST 60 LINES OF THE CONSOLE ###########################
[...truncated 7221 lines...]
[INFO] --- maven-clean-plugin:2.5:clean (default-clean) @ hadoop-hdfs-project ---
[INFO] Deleting /home/jenkins/jenkins-slave/workspace/Hadoop-Hdfs-trunk/hadoop-hdfs-project/target
[INFO] 
[INFO] --- maven-antrun-plugin:1.7:run (create-testdirs) @ hadoop-hdfs-project ---
[INFO] Executing tasks

main:
    [mkdir] Created dir: /home/jenkins/jenkins-slave/workspace/Hadoop-Hdfs-trunk/hadoop-hdfs-project/target/test-dir
[INFO] Executed tasks
[INFO] 
[INFO] --- maven-source-plugin:2.3:jar-no-fork (hadoop-java-sources) @ hadoop-hdfs-project
---
[INFO] 
[INFO] --- maven-source-plugin:2.3:test-jar-no-fork (hadoop-java-sources) @ hadoop-hdfs-project
---
[INFO] 
[INFO] --- maven-enforcer-plugin:1.3.1:enforce (dist-enforce) @ hadoop-hdfs-project ---
[INFO] 
[INFO] --- maven-site-plugin:3.5:attach-descriptor (attach-descriptor) @ hadoop-hdfs-project
---
[INFO] 
[INFO] --- maven-javadoc-plugin:2.8.1:jar (module-javadocs) @ hadoop-hdfs-project ---
[INFO] Skipping javadoc generation
[INFO] 
[INFO] --- maven-enforcer-plugin:1.3.1:enforce (depcheck) @ hadoop-hdfs-project ---
[INFO] 
[INFO] --- maven-checkstyle-plugin:2.15:checkstyle (default-cli) @ hadoop-hdfs-project ---
[INFO] 
[INFO] --- findbugs-maven-plugin:3.0.0:findbugs (default-cli) @ hadoop-hdfs-project ---
[INFO] ------------------------------------------------------------------------
[INFO] Reactor Summary:
[INFO] 
[INFO] Apache Hadoop HDFS Client ......................... SUCCESS [05:30 min]
[INFO] Apache Hadoop HDFS ................................ FAILURE [  01:16 h]
[INFO] Apache Hadoop HDFS Native Client .................. SKIPPED
[INFO] Apache Hadoop HttpFS .............................. SKIPPED
[INFO] Apache Hadoop HDFS BookKeeper Journal ............. SKIPPED
[INFO] Apache Hadoop HDFS-NFS ............................ SKIPPED
[INFO] Apache Hadoop HDFS Project ........................ SUCCESS [  0.128 s]
[INFO] ------------------------------------------------------------------------
[INFO] BUILD FAILURE
[INFO] ------------------------------------------------------------------------
[INFO] Total time: 01:22 h
[INFO] Finished at: 2016-05-06T01:20:04+00:00
[INFO] Final Memory: 59M/848M
[INFO] ------------------------------------------------------------------------
[ERROR] Failed to execute goal org.apache.maven.plugins:maven-surefire-plugin:2.17:test (default-test)
on project hadoop-hdfs: ExecutionException: java.lang.RuntimeException: java.lang.RuntimeException:
java.io.IOException: Stream Closed -> [Help 1]
[ERROR] 
[ERROR] To see the full stack trace of the errors, re-run Maven with the -e switch.
[ERROR] Re-run Maven using the -X switch to enable full debug logging.
[ERROR] 
[ERROR] For more information about the errors and possible solutions, please read the following
articles:
[ERROR] [Help 1] http://cwiki.apache.org/confluence/display/MAVEN/MojoFailureException
[ERROR] 
[ERROR] After correcting the problems, you can resume the build with the command
[ERROR]   mvn <goals> -rf :hadoop-hdfs
Build step 'Execute shell' marked build as failure
Archiving artifacts
Recording test results
Sending e-mails to: hdfs-dev@hadoop.apache.org
Email was triggered for: Failure - Any
Sending email for trigger: Failure - Any



###################################################################################
############################## FAILED TESTS (if any) ##############################
6 tests failed.
FAILED:  org.apache.hadoop.hdfs.TestAsyncDFSRename.testAggressiveConcurrentAsyncRenameWithOverwrite

Error Message:
test timed out after 120000 milliseconds

Stack Trace:
java.lang.Exception: test timed out after 120000 milliseconds
	at java.lang.Object.wait(Native Method)
	at java.lang.Object.wait(Object.java:503)
	at org.apache.hadoop.ipc.Client.getRpcResponse(Client.java:1477)
	at org.apache.hadoop.ipc.Client.call(Client.java:1436)
	at org.apache.hadoop.ipc.Client.call(Client.java:1358)
	at org.apache.hadoop.ipc.ProtobufRpcEngine$Invoker.invoke(ProtobufRpcEngine.java:241)
	at com.sun.proxy.$Proxy21.create(Unknown Source)
	at org.apache.hadoop.hdfs.protocolPB.ClientNamenodeProtocolTranslatorPB.create(ClientNamenodeProtocolTranslatorPB.java:306)
	at sun.reflect.GeneratedMethodAccessor11.invoke(Unknown Source)
	at sun.reflect.DelegatingMethodAccessorImpl.invoke(DelegatingMethodAccessorImpl.java:43)
	at java.lang.reflect.Method.invoke(Method.java:606)
	at org.apache.hadoop.io.retry.RetryInvocationHandler.invokeMethod(RetryInvocationHandler.java:257)
	at org.apache.hadoop.io.retry.RetryInvocationHandler.invoke(RetryInvocationHandler.java:103)
	at com.sun.proxy.$Proxy23.create(Unknown Source)
	at org.apache.hadoop.hdfs.DFSOutputStream.newStreamForCreate(DFSOutputStream.java:249)
	at org.apache.hadoop.hdfs.DFSClient.create(DFSClient.java:1183)
	at org.apache.hadoop.hdfs.DFSClient.create(DFSClient.java:1125)
	at org.apache.hadoop.hdfs.DistributedFileSystem$7.doCall(DistributedFileSystem.java:415)
	at org.apache.hadoop.hdfs.DistributedFileSystem$7.doCall(DistributedFileSystem.java:412)
	at org.apache.hadoop.fs.FileSystemLinkResolver.resolve(FileSystemLinkResolver.java:81)
	at org.apache.hadoop.hdfs.DistributedFileSystem.create(DistributedFileSystem.java:412)
	at org.apache.hadoop.fs.FileSystem.create(FileSystem.java:968)
	at org.apache.hadoop.hdfs.DFSTestUtil.createFile(DFSTestUtil.java:400)
	at org.apache.hadoop.hdfs.DFSTestUtil.createFile(DFSTestUtil.java:379)
	at org.apache.hadoop.hdfs.DFSTestUtil.createFile(DFSTestUtil.java:372)
	at org.apache.hadoop.hdfs.DFSTestUtil.createFile(DFSTestUtil.java:365)
	at org.apache.hadoop.hdfs.TestAsyncDFSRename.internalTestConcurrentAsyncRenameWithOverwrite(TestAsyncDFSRename.java:220)
	at org.apache.hadoop.hdfs.TestAsyncDFSRename.testAggressiveConcurrentAsyncRenameWithOverwrite(TestAsyncDFSRename.java:184)


FAILED:  org.apache.hadoop.hdfs.TestAsyncDFSRename.testCallGetReturnValueMultipleTimes

Error Message:
Cannot remove data directory: /home/jenkins/jenkins-slave/workspace/Hadoop-Hdfs-trunk/hadoop-hdfs-project/hadoop-hdfs/target/test/data/1/dfs/datapath
'/home/jenkins/jenkins-slave/workspace/Hadoop-Hdfs-trunk/hadoop-hdfs-project/hadoop-hdfs/target/test/data/1/dfs/data':

 absolute:/home/jenkins/jenkins-slave/workspace/Hadoop-Hdfs-trunk/hadoop-hdfs-project/hadoop-hdfs/target/test/data/1/dfs/data
 permissions: drwx
path '/home/jenkins/jenkins-slave/workspace/Hadoop-Hdfs-trunk/hadoop-hdfs-project/hadoop-hdfs/target/test/data/1/dfs':

 absolute:/home/jenkins/jenkins-slave/workspace/Hadoop-Hdfs-trunk/hadoop-hdfs-project/hadoop-hdfs/target/test/data/1/dfs
 permissions: drwx
path '/home/jenkins/jenkins-slave/workspace/Hadoop-Hdfs-trunk/hadoop-hdfs-project/hadoop-hdfs/target/test/data/1':

 absolute:/home/jenkins/jenkins-slave/workspace/Hadoop-Hdfs-trunk/hadoop-hdfs-project/hadoop-hdfs/target/test/data/1
 permissions: drwx
path '/home/jenkins/jenkins-slave/workspace/Hadoop-Hdfs-trunk/hadoop-hdfs-project/hadoop-hdfs/target/test/data':

 absolute:/home/jenkins/jenkins-slave/workspace/Hadoop-Hdfs-trunk/hadoop-hdfs-project/hadoop-hdfs/target/test/data
 permissions: drwx
path '/home/jenkins/jenkins-slave/workspace/Hadoop-Hdfs-trunk/hadoop-hdfs-project/hadoop-hdfs/target/test':

 absolute:/home/jenkins/jenkins-slave/workspace/Hadoop-Hdfs-trunk/hadoop-hdfs-project/hadoop-hdfs/target/test
 permissions: drwx
path '/home/jenkins/jenkins-slave/workspace/Hadoop-Hdfs-trunk/hadoop-hdfs-project/hadoop-hdfs/target':

 absolute:/home/jenkins/jenkins-slave/workspace/Hadoop-Hdfs-trunk/hadoop-hdfs-project/hadoop-hdfs/target
 permissions: drwx
path '/home/jenkins/jenkins-slave/workspace/Hadoop-Hdfs-trunk/hadoop-hdfs-project/hadoop-hdfs':

 absolute:/home/jenkins/jenkins-slave/workspace/Hadoop-Hdfs-trunk/hadoop-hdfs-project/hadoop-hdfs
 permissions: drwx
path '/home/jenkins/jenkins-slave/workspace/Hadoop-Hdfs-trunk/hadoop-hdfs-project': 
 absolute:/home/jenkins/jenkins-slave/workspace/Hadoop-Hdfs-trunk/hadoop-hdfs-project
 permissions: drwx
path '/home/jenkins/jenkins-slave/workspace/Hadoop-Hdfs-trunk': 
 absolute:/home/jenkins/jenkins-slave/workspace/Hadoop-Hdfs-trunk
 permissions: drwx
path '/home/jenkins/jenkins-slave/workspace': 
 absolute:/home/jenkins/jenkins-slave/workspace
 permissions: drwx
path '/home/jenkins/jenkins-slave': 
 absolute:/home/jenkins/jenkins-slave
 permissions: drwx
path '/home/jenkins': 
 absolute:/home/jenkins
 permissions: drwx
path '/home': 
 absolute:/home
 permissions: dr-x
path '/': 
 absolute:/
 permissions: dr-x


Stack Trace:
java.io.IOException: Cannot remove data directory: /home/jenkins/jenkins-slave/workspace/Hadoop-Hdfs-trunk/hadoop-hdfs-project/hadoop-hdfs/target/test/data/1/dfs/datapath
'/home/jenkins/jenkins-slave/workspace/Hadoop-Hdfs-trunk/hadoop-hdfs-project/hadoop-hdfs/target/test/data/1/dfs/data':

	absolute:/home/jenkins/jenkins-slave/workspace/Hadoop-Hdfs-trunk/hadoop-hdfs-project/hadoop-hdfs/target/test/data/1/dfs/data
	permissions: drwx
path '/home/jenkins/jenkins-slave/workspace/Hadoop-Hdfs-trunk/hadoop-hdfs-project/hadoop-hdfs/target/test/data/1/dfs':

	absolute:/home/jenkins/jenkins-slave/workspace/Hadoop-Hdfs-trunk/hadoop-hdfs-project/hadoop-hdfs/target/test/data/1/dfs
	permissions: drwx
path '/home/jenkins/jenkins-slave/workspace/Hadoop-Hdfs-trunk/hadoop-hdfs-project/hadoop-hdfs/target/test/data/1':

	absolute:/home/jenkins/jenkins-slave/workspace/Hadoop-Hdfs-trunk/hadoop-hdfs-project/hadoop-hdfs/target/test/data/1
	permissions: drwx
path '/home/jenkins/jenkins-slave/workspace/Hadoop-Hdfs-trunk/hadoop-hdfs-project/hadoop-hdfs/target/test/data':

	absolute:/home/jenkins/jenkins-slave/workspace/Hadoop-Hdfs-trunk/hadoop-hdfs-project/hadoop-hdfs/target/test/data
	permissions: drwx
path '/home/jenkins/jenkins-slave/workspace/Hadoop-Hdfs-trunk/hadoop-hdfs-project/hadoop-hdfs/target/test':

	absolute:/home/jenkins/jenkins-slave/workspace/Hadoop-Hdfs-trunk/hadoop-hdfs-project/hadoop-hdfs/target/test
	permissions: drwx
path '/home/jenkins/jenkins-slave/workspace/Hadoop-Hdfs-trunk/hadoop-hdfs-project/hadoop-hdfs/target':

	absolute:/home/jenkins/jenkins-slave/workspace/Hadoop-Hdfs-trunk/hadoop-hdfs-project/hadoop-hdfs/target
	permissions: drwx
path '/home/jenkins/jenkins-slave/workspace/Hadoop-Hdfs-trunk/hadoop-hdfs-project/hadoop-hdfs':

	absolute:/home/jenkins/jenkins-slave/workspace/Hadoop-Hdfs-trunk/hadoop-hdfs-project/hadoop-hdfs
	permissions: drwx
path '/home/jenkins/jenkins-slave/workspace/Hadoop-Hdfs-trunk/hadoop-hdfs-project': 
	absolute:/home/jenkins/jenkins-slave/workspace/Hadoop-Hdfs-trunk/hadoop-hdfs-project
	permissions: drwx
path '/home/jenkins/jenkins-slave/workspace/Hadoop-Hdfs-trunk': 
	absolute:/home/jenkins/jenkins-slave/workspace/Hadoop-Hdfs-trunk
	permissions: drwx
path '/home/jenkins/jenkins-slave/workspace': 
	absolute:/home/jenkins/jenkins-slave/workspace
	permissions: drwx
path '/home/jenkins/jenkins-slave': 
	absolute:/home/jenkins/jenkins-slave
	permissions: drwx
path '/home/jenkins': 
	absolute:/home/jenkins
	permissions: drwx
path '/home': 
	absolute:/home
	permissions: dr-x
path '/': 
	absolute:/
	permissions: dr-x

	at org.apache.hadoop.hdfs.MiniDFSCluster.initMiniDFSCluster(MiniDFSCluster.java:834)
	at org.apache.hadoop.hdfs.MiniDFSCluster.<init>(MiniDFSCluster.java:482)
	at org.apache.hadoop.hdfs.MiniDFSCluster$Builder.build(MiniDFSCluster.java:441)
	at org.apache.hadoop.hdfs.TestAsyncDFSRename.testCallGetReturnValueMultipleTimes(TestAsyncDFSRename.java:124)


FAILED:  org.apache.hadoop.hdfs.TestAsyncDFSRename.testConservativeConcurrentAsyncRenameWithOverwrite

Error Message:
test timed out after 60000 milliseconds

Stack Trace:
java.lang.Exception: test timed out after 60000 milliseconds
	at java.lang.Thread.sleep(Native Method)
	at org.apache.hadoop.hdfs.DFSOutputStream.completeFile(DFSOutputStream.java:825)
	at org.apache.hadoop.hdfs.DFSOutputStream.closeImpl(DFSOutputStream.java:784)
	at org.apache.hadoop.hdfs.DFSOutputStream.close(DFSOutputStream.java:755)
	at org.apache.hadoop.fs.FSDataOutputStream$PositionCache.close(FSDataOutputStream.java:72)
	at org.apache.hadoop.fs.FSDataOutputStream.close(FSDataOutputStream.java:101)
	at org.apache.hadoop.hdfs.DFSTestUtil.createFile(DFSTestUtil.java:430)
	at org.apache.hadoop.hdfs.DFSTestUtil.createFile(DFSTestUtil.java:379)
	at org.apache.hadoop.hdfs.DFSTestUtil.createFile(DFSTestUtil.java:372)
	at org.apache.hadoop.hdfs.DFSTestUtil.createFile(DFSTestUtil.java:365)
	at org.apache.hadoop.hdfs.TestAsyncDFSRename.internalTestConcurrentAsyncRenameWithOverwrite(TestAsyncDFSRename.java:221)
	at org.apache.hadoop.hdfs.TestAsyncDFSRename.testConservativeConcurrentAsyncRenameWithOverwrite(TestAsyncDFSRename.java:191)


FAILED:  org.apache.hadoop.hdfs.TestAsyncDFSRename.testAsyncRenameWithOverwrite

Error Message:
Cannot remove data directory: /home/jenkins/jenkins-slave/workspace/Hadoop-Hdfs-trunk/hadoop-hdfs-project/hadoop-hdfs/target/test/data/1/dfs/datapath
'/home/jenkins/jenkins-slave/workspace/Hadoop-Hdfs-trunk/hadoop-hdfs-project/hadoop-hdfs/target/test/data/1/dfs/data':

 absolute:/home/jenkins/jenkins-slave/workspace/Hadoop-Hdfs-trunk/hadoop-hdfs-project/hadoop-hdfs/target/test/data/1/dfs/data
 permissions: drwx
path '/home/jenkins/jenkins-slave/workspace/Hadoop-Hdfs-trunk/hadoop-hdfs-project/hadoop-hdfs/target/test/data/1/dfs':

 absolute:/home/jenkins/jenkins-slave/workspace/Hadoop-Hdfs-trunk/hadoop-hdfs-project/hadoop-hdfs/target/test/data/1/dfs
 permissions: drwx
path '/home/jenkins/jenkins-slave/workspace/Hadoop-Hdfs-trunk/hadoop-hdfs-project/hadoop-hdfs/target/test/data/1':

 absolute:/home/jenkins/jenkins-slave/workspace/Hadoop-Hdfs-trunk/hadoop-hdfs-project/hadoop-hdfs/target/test/data/1
 permissions: drwx
path '/home/jenkins/jenkins-slave/workspace/Hadoop-Hdfs-trunk/hadoop-hdfs-project/hadoop-hdfs/target/test/data':

 absolute:/home/jenkins/jenkins-slave/workspace/Hadoop-Hdfs-trunk/hadoop-hdfs-project/hadoop-hdfs/target/test/data
 permissions: drwx
path '/home/jenkins/jenkins-slave/workspace/Hadoop-Hdfs-trunk/hadoop-hdfs-project/hadoop-hdfs/target/test':

 absolute:/home/jenkins/jenkins-slave/workspace/Hadoop-Hdfs-trunk/hadoop-hdfs-project/hadoop-hdfs/target/test
 permissions: drwx
path '/home/jenkins/jenkins-slave/workspace/Hadoop-Hdfs-trunk/hadoop-hdfs-project/hadoop-hdfs/target':

 absolute:/home/jenkins/jenkins-slave/workspace/Hadoop-Hdfs-trunk/hadoop-hdfs-project/hadoop-hdfs/target
 permissions: drwx
path '/home/jenkins/jenkins-slave/workspace/Hadoop-Hdfs-trunk/hadoop-hdfs-project/hadoop-hdfs':

 absolute:/home/jenkins/jenkins-slave/workspace/Hadoop-Hdfs-trunk/hadoop-hdfs-project/hadoop-hdfs
 permissions: drwx
path '/home/jenkins/jenkins-slave/workspace/Hadoop-Hdfs-trunk/hadoop-hdfs-project': 
 absolute:/home/jenkins/jenkins-slave/workspace/Hadoop-Hdfs-trunk/hadoop-hdfs-project
 permissions: drwx
path '/home/jenkins/jenkins-slave/workspace/Hadoop-Hdfs-trunk': 
 absolute:/home/jenkins/jenkins-slave/workspace/Hadoop-Hdfs-trunk
 permissions: drwx
path '/home/jenkins/jenkins-slave/workspace': 
 absolute:/home/jenkins/jenkins-slave/workspace
 permissions: drwx
path '/home/jenkins/jenkins-slave': 
 absolute:/home/jenkins/jenkins-slave
 permissions: drwx
path '/home/jenkins': 
 absolute:/home/jenkins
 permissions: drwx
path '/home': 
 absolute:/home
 permissions: dr-x
path '/': 
 absolute:/
 permissions: dr-x


Stack Trace:
java.io.IOException: Cannot remove data directory: /home/jenkins/jenkins-slave/workspace/Hadoop-Hdfs-trunk/hadoop-hdfs-project/hadoop-hdfs/target/test/data/1/dfs/datapath
'/home/jenkins/jenkins-slave/workspace/Hadoop-Hdfs-trunk/hadoop-hdfs-project/hadoop-hdfs/target/test/data/1/dfs/data':

	absolute:/home/jenkins/jenkins-slave/workspace/Hadoop-Hdfs-trunk/hadoop-hdfs-project/hadoop-hdfs/target/test/data/1/dfs/data
	permissions: drwx
path '/home/jenkins/jenkins-slave/workspace/Hadoop-Hdfs-trunk/hadoop-hdfs-project/hadoop-hdfs/target/test/data/1/dfs':

	absolute:/home/jenkins/jenkins-slave/workspace/Hadoop-Hdfs-trunk/hadoop-hdfs-project/hadoop-hdfs/target/test/data/1/dfs
	permissions: drwx
path '/home/jenkins/jenkins-slave/workspace/Hadoop-Hdfs-trunk/hadoop-hdfs-project/hadoop-hdfs/target/test/data/1':

	absolute:/home/jenkins/jenkins-slave/workspace/Hadoop-Hdfs-trunk/hadoop-hdfs-project/hadoop-hdfs/target/test/data/1
	permissions: drwx
path '/home/jenkins/jenkins-slave/workspace/Hadoop-Hdfs-trunk/hadoop-hdfs-project/hadoop-hdfs/target/test/data':

	absolute:/home/jenkins/jenkins-slave/workspace/Hadoop-Hdfs-trunk/hadoop-hdfs-project/hadoop-hdfs/target/test/data
	permissions: drwx
path '/home/jenkins/jenkins-slave/workspace/Hadoop-Hdfs-trunk/hadoop-hdfs-project/hadoop-hdfs/target/test':

	absolute:/home/jenkins/jenkins-slave/workspace/Hadoop-Hdfs-trunk/hadoop-hdfs-project/hadoop-hdfs/target/test
	permissions: drwx
path '/home/jenkins/jenkins-slave/workspace/Hadoop-Hdfs-trunk/hadoop-hdfs-project/hadoop-hdfs/target':

	absolute:/home/jenkins/jenkins-slave/workspace/Hadoop-Hdfs-trunk/hadoop-hdfs-project/hadoop-hdfs/target
	permissions: drwx
path '/home/jenkins/jenkins-slave/workspace/Hadoop-Hdfs-trunk/hadoop-hdfs-project/hadoop-hdfs':

	absolute:/home/jenkins/jenkins-slave/workspace/Hadoop-Hdfs-trunk/hadoop-hdfs-project/hadoop-hdfs
	permissions: drwx
path '/home/jenkins/jenkins-slave/workspace/Hadoop-Hdfs-trunk/hadoop-hdfs-project': 
	absolute:/home/jenkins/jenkins-slave/workspace/Hadoop-Hdfs-trunk/hadoop-hdfs-project
	permissions: drwx
path '/home/jenkins/jenkins-slave/workspace/Hadoop-Hdfs-trunk': 
	absolute:/home/jenkins/jenkins-slave/workspace/Hadoop-Hdfs-trunk
	permissions: drwx
path '/home/jenkins/jenkins-slave/workspace': 
	absolute:/home/jenkins/jenkins-slave/workspace
	permissions: drwx
path '/home/jenkins/jenkins-slave': 
	absolute:/home/jenkins/jenkins-slave
	permissions: drwx
path '/home/jenkins': 
	absolute:/home/jenkins
	permissions: drwx
path '/home': 
	absolute:/home
	permissions: dr-x
path '/': 
	absolute:/
	permissions: dr-x

	at org.apache.hadoop.hdfs.MiniDFSCluster.initMiniDFSCluster(MiniDFSCluster.java:834)
	at org.apache.hadoop.hdfs.MiniDFSCluster.<init>(MiniDFSCluster.java:482)
	at org.apache.hadoop.hdfs.MiniDFSCluster$Builder.build(MiniDFSCluster.java:441)
	at org.apache.hadoop.hdfs.TestAsyncDFSRename.testAsyncRenameWithOverwrite(TestAsyncDFSRename.java:56)


FAILED:  org.apache.hadoop.hdfs.TestDFSShell.testMoveWithTargetPortEmpty

Error Message:
Problem binding to [localhost:9820] java.net.BindException: Address already in use; For more
details see:  http://wiki.apache.org/hadoop/BindException

Stack Trace:
java.net.BindException: Problem binding to [localhost:9820] java.net.BindException: Address
already in use; For more details see:  http://wiki.apache.org/hadoop/BindException
	at sun.nio.ch.Net.bind0(Native Method)
	at sun.nio.ch.Net.bind(Net.java:444)
	at sun.nio.ch.Net.bind(Net.java:436)
	at sun.nio.ch.ServerSocketChannelImpl.bind(ServerSocketChannelImpl.java:214)
	at sun.nio.ch.ServerSocketAdaptor.bind(ServerSocketAdaptor.java:74)
	at org.apache.hadoop.ipc.Server.bind(Server.java:530)
	at org.apache.hadoop.ipc.Server$Listener.<init>(Server.java:793)
	at org.apache.hadoop.ipc.Server.<init>(Server.java:2592)
	at org.apache.hadoop.ipc.RPC$Server.<init>(RPC.java:958)
	at org.apache.hadoop.ipc.ProtobufRpcEngine$Server.<init>(ProtobufRpcEngine.java:563)
	at org.apache.hadoop.ipc.ProtobufRpcEngine.getServer(ProtobufRpcEngine.java:538)
	at org.apache.hadoop.ipc.RPC$Builder.build(RPC.java:800)
	at org.apache.hadoop.hdfs.server.namenode.NameNodeRpcServer.<init>(NameNodeRpcServer.java:426)
	at org.apache.hadoop.hdfs.server.namenode.NameNode.createRpcServer(NameNode.java:783)
	at org.apache.hadoop.hdfs.server.namenode.NameNode.initialize(NameNode.java:710)
	at org.apache.hadoop.hdfs.server.namenode.NameNode.<init>(NameNode.java:924)
	at org.apache.hadoop.hdfs.server.namenode.NameNode.<init>(NameNode.java:903)
	at org.apache.hadoop.hdfs.server.namenode.NameNode.createNameNode(NameNode.java:1620)
	at org.apache.hadoop.hdfs.MiniDFSCluster.createNameNode(MiniDFSCluster.java:1247)
	at org.apache.hadoop.hdfs.MiniDFSCluster.configureNameService(MiniDFSCluster.java:1016)
	at org.apache.hadoop.hdfs.MiniDFSCluster.createNameNodesAndSetConf(MiniDFSCluster.java:891)
	at org.apache.hadoop.hdfs.MiniDFSCluster.initMiniDFSCluster(MiniDFSCluster.java:823)
	at org.apache.hadoop.hdfs.MiniDFSCluster.<init>(MiniDFSCluster.java:482)
	at org.apache.hadoop.hdfs.MiniDFSCluster$Builder.build(MiniDFSCluster.java:441)
	at org.apache.hadoop.hdfs.TestDFSShell.testMoveWithTargetPortEmpty(TestDFSShell.java:567)


FAILED:  org.apache.hadoop.hdfs.server.datanode.TestDirectoryScanner.testThrottling

Error Message:
Throttle is too permissive

Stack Trace:
java.lang.AssertionError: Throttle is too permissive
	at org.junit.Assert.fail(Assert.java:88)
	at org.junit.Assert.assertTrue(Assert.java:41)
	at org.apache.hadoop.hdfs.server.datanode.TestDirectoryScanner.testThrottling(TestDirectoryScanner.java:599)




Mime
View raw message