hadoop-hdfs-dev mailing list archives

Site index · List index
Message view « Date » · « Thread »
Top « Date » · « Thread »
From Apache Jenkins Server <jenk...@builds.apache.org>
Subject Hadoop-Hdfs-trunk - Build # 3120 - Failure
Date Tue, 10 May 2016 01:19:30 GMT
See https://builds.apache.org/job/Hadoop-Hdfs-trunk/3120/

###################################################################################
########################## LAST 60 LINES OF THE CONSOLE ###########################
[...truncated 8059 lines...]
[INFO] --- maven-antrun-plugin:1.7:run (create-testdirs) @ hadoop-hdfs-project ---
[INFO] Executing tasks

main:
    [mkdir] Created dir: /home/jenkins/jenkins-slave/workspace/Hadoop-Hdfs-trunk/hadoop-hdfs-project/target/test-dir
[INFO] Executed tasks
[INFO] 
[INFO] --- maven-source-plugin:2.3:jar-no-fork (hadoop-java-sources) @ hadoop-hdfs-project
---
[INFO] 
[INFO] --- maven-source-plugin:2.3:test-jar-no-fork (hadoop-java-sources) @ hadoop-hdfs-project
---
[INFO] 
[INFO] --- maven-enforcer-plugin:1.3.1:enforce (dist-enforce) @ hadoop-hdfs-project ---
[INFO] 
[INFO] --- maven-site-plugin:3.5:attach-descriptor (attach-descriptor) @ hadoop-hdfs-project
---
[INFO] 
[INFO] --- maven-javadoc-plugin:2.8.1:jar (module-javadocs) @ hadoop-hdfs-project ---
[INFO] Skipping javadoc generation
[INFO] 
[INFO] --- maven-enforcer-plugin:1.3.1:enforce (depcheck) @ hadoop-hdfs-project ---
[INFO] 
[INFO] --- maven-checkstyle-plugin:2.15:checkstyle (default-cli) @ hadoop-hdfs-project ---
[INFO] 
[INFO] --- findbugs-maven-plugin:3.0.0:findbugs (default-cli) @ hadoop-hdfs-project ---
[INFO] ------------------------------------------------------------------------
[INFO] Reactor Summary:
[INFO] 
[INFO] Apache Hadoop HDFS Client ......................... SUCCESS [06:09 min]
[INFO] Apache Hadoop HDFS ................................ FAILURE [  01:29 h]
[INFO] Apache Hadoop HDFS Native Client .................. SKIPPED
[INFO] Apache Hadoop HttpFS .............................. SKIPPED
[INFO] Apache Hadoop HDFS BookKeeper Journal ............. SKIPPED
[INFO] Apache Hadoop HDFS-NFS ............................ SKIPPED
[INFO] Apache Hadoop HDFS Project ........................ SUCCESS [  0.145 s]
[INFO] ------------------------------------------------------------------------
[INFO] BUILD FAILURE
[INFO] ------------------------------------------------------------------------
[INFO] Total time: 01:35 h
[INFO] Finished at: 2016-05-10T01:19:01+00:00
[INFO] Final Memory: 57M/839M
[INFO] ------------------------------------------------------------------------
[ERROR] Failed to execute goal org.apache.maven.plugins:maven-surefire-plugin:2.17:test (default-test)
on project hadoop-hdfs: There are test failures.
[ERROR] 
[ERROR] Please refer to /home/jenkins/jenkins-slave/workspace/Hadoop-Hdfs-trunk/hadoop-hdfs-project/hadoop-hdfs/target/surefire-reports
for the individual test results.
[ERROR] -> [Help 1]
[ERROR] 
[ERROR] To see the full stack trace of the errors, re-run Maven with the -e switch.
[ERROR] Re-run Maven using the -X switch to enable full debug logging.
[ERROR] 
[ERROR] For more information about the errors and possible solutions, please read the following
articles:
[ERROR] [Help 1] http://cwiki.apache.org/confluence/display/MAVEN/MojoFailureException
[ERROR] 
[ERROR] After correcting the problems, you can resume the build with the command
[ERROR]   mvn <goals> -rf :hadoop-hdfs
Build step 'Execute shell' marked build as failure
Archiving artifacts
Recording test results
Sending e-mails to: hdfs-dev@hadoop.apache.org
Email was triggered for: Failure - Any
Sending email for trigger: Failure - Any



###################################################################################
############################## FAILED TESTS (if any) ##############################
13 tests failed.
FAILED:  org.apache.hadoop.hdfs.TestAsyncDFSRename.testAggressiveConcurrentAsyncRenameWithOverwrite

Error Message:
test timed out after 120000 milliseconds

Stack Trace:
java.lang.Exception: test timed out after 120000 milliseconds
	at java.lang.Thread.sleep(Native Method)
	at org.apache.hadoop.hdfs.DFSOutputStream.completeFile(DFSOutputStream.java:825)
	at org.apache.hadoop.hdfs.DFSOutputStream.closeImpl(DFSOutputStream.java:784)
	at org.apache.hadoop.hdfs.DFSOutputStream.close(DFSOutputStream.java:755)
	at org.apache.hadoop.fs.FSDataOutputStream$PositionCache.close(FSDataOutputStream.java:72)
	at org.apache.hadoop.fs.FSDataOutputStream.close(FSDataOutputStream.java:101)
	at org.apache.hadoop.hdfs.DFSTestUtil.createFile(DFSTestUtil.java:430)
	at org.apache.hadoop.hdfs.DFSTestUtil.createFile(DFSTestUtil.java:379)
	at org.apache.hadoop.hdfs.DFSTestUtil.createFile(DFSTestUtil.java:372)
	at org.apache.hadoop.hdfs.DFSTestUtil.createFile(DFSTestUtil.java:365)
	at org.apache.hadoop.hdfs.TestAsyncDFSRename.internalTestConcurrentAsyncRenameWithOverwrite(TestAsyncDFSRename.java:221)
	at org.apache.hadoop.hdfs.TestAsyncDFSRename.testAggressiveConcurrentAsyncRenameWithOverwrite(TestAsyncDFSRename.java:184)


FAILED:  org.apache.hadoop.hdfs.TestAsyncDFSRename.testCallGetReturnValueMultipleTimes

Error Message:
Cannot remove data directory: /home/jenkins/jenkins-slave/workspace/Hadoop-Hdfs-trunk/hadoop-hdfs-project/hadoop-hdfs/target/test/data/4/dfs/datapath
'/home/jenkins/jenkins-slave/workspace/Hadoop-Hdfs-trunk/hadoop-hdfs-project/hadoop-hdfs/target/test/data/4/dfs/data':

 absolute:/home/jenkins/jenkins-slave/workspace/Hadoop-Hdfs-trunk/hadoop-hdfs-project/hadoop-hdfs/target/test/data/4/dfs/data
 permissions: drwx
path '/home/jenkins/jenkins-slave/workspace/Hadoop-Hdfs-trunk/hadoop-hdfs-project/hadoop-hdfs/target/test/data/4/dfs':

 absolute:/home/jenkins/jenkins-slave/workspace/Hadoop-Hdfs-trunk/hadoop-hdfs-project/hadoop-hdfs/target/test/data/4/dfs
 permissions: drwx
path '/home/jenkins/jenkins-slave/workspace/Hadoop-Hdfs-trunk/hadoop-hdfs-project/hadoop-hdfs/target/test/data/4':

 absolute:/home/jenkins/jenkins-slave/workspace/Hadoop-Hdfs-trunk/hadoop-hdfs-project/hadoop-hdfs/target/test/data/4
 permissions: drwx
path '/home/jenkins/jenkins-slave/workspace/Hadoop-Hdfs-trunk/hadoop-hdfs-project/hadoop-hdfs/target/test/data':

 absolute:/home/jenkins/jenkins-slave/workspace/Hadoop-Hdfs-trunk/hadoop-hdfs-project/hadoop-hdfs/target/test/data
 permissions: drwx
path '/home/jenkins/jenkins-slave/workspace/Hadoop-Hdfs-trunk/hadoop-hdfs-project/hadoop-hdfs/target/test':

 absolute:/home/jenkins/jenkins-slave/workspace/Hadoop-Hdfs-trunk/hadoop-hdfs-project/hadoop-hdfs/target/test
 permissions: drwx
path '/home/jenkins/jenkins-slave/workspace/Hadoop-Hdfs-trunk/hadoop-hdfs-project/hadoop-hdfs/target':

 absolute:/home/jenkins/jenkins-slave/workspace/Hadoop-Hdfs-trunk/hadoop-hdfs-project/hadoop-hdfs/target
 permissions: drwx
path '/home/jenkins/jenkins-slave/workspace/Hadoop-Hdfs-trunk/hadoop-hdfs-project/hadoop-hdfs':

 absolute:/home/jenkins/jenkins-slave/workspace/Hadoop-Hdfs-trunk/hadoop-hdfs-project/hadoop-hdfs
 permissions: drwx
path '/home/jenkins/jenkins-slave/workspace/Hadoop-Hdfs-trunk/hadoop-hdfs-project': 
 absolute:/home/jenkins/jenkins-slave/workspace/Hadoop-Hdfs-trunk/hadoop-hdfs-project
 permissions: drwx
path '/home/jenkins/jenkins-slave/workspace/Hadoop-Hdfs-trunk': 
 absolute:/home/jenkins/jenkins-slave/workspace/Hadoop-Hdfs-trunk
 permissions: drwx
path '/home/jenkins/jenkins-slave/workspace': 
 absolute:/home/jenkins/jenkins-slave/workspace
 permissions: drwx
path '/home/jenkins/jenkins-slave': 
 absolute:/home/jenkins/jenkins-slave
 permissions: drwx
path '/home/jenkins': 
 absolute:/home/jenkins
 permissions: drwx
path '/home': 
 absolute:/home
 permissions: dr-x
path '/': 
 absolute:/
 permissions: dr-x


Stack Trace:
java.io.IOException: Cannot remove data directory: /home/jenkins/jenkins-slave/workspace/Hadoop-Hdfs-trunk/hadoop-hdfs-project/hadoop-hdfs/target/test/data/4/dfs/datapath
'/home/jenkins/jenkins-slave/workspace/Hadoop-Hdfs-trunk/hadoop-hdfs-project/hadoop-hdfs/target/test/data/4/dfs/data':

	absolute:/home/jenkins/jenkins-slave/workspace/Hadoop-Hdfs-trunk/hadoop-hdfs-project/hadoop-hdfs/target/test/data/4/dfs/data
	permissions: drwx
path '/home/jenkins/jenkins-slave/workspace/Hadoop-Hdfs-trunk/hadoop-hdfs-project/hadoop-hdfs/target/test/data/4/dfs':

	absolute:/home/jenkins/jenkins-slave/workspace/Hadoop-Hdfs-trunk/hadoop-hdfs-project/hadoop-hdfs/target/test/data/4/dfs
	permissions: drwx
path '/home/jenkins/jenkins-slave/workspace/Hadoop-Hdfs-trunk/hadoop-hdfs-project/hadoop-hdfs/target/test/data/4':

	absolute:/home/jenkins/jenkins-slave/workspace/Hadoop-Hdfs-trunk/hadoop-hdfs-project/hadoop-hdfs/target/test/data/4
	permissions: drwx
path '/home/jenkins/jenkins-slave/workspace/Hadoop-Hdfs-trunk/hadoop-hdfs-project/hadoop-hdfs/target/test/data':

	absolute:/home/jenkins/jenkins-slave/workspace/Hadoop-Hdfs-trunk/hadoop-hdfs-project/hadoop-hdfs/target/test/data
	permissions: drwx
path '/home/jenkins/jenkins-slave/workspace/Hadoop-Hdfs-trunk/hadoop-hdfs-project/hadoop-hdfs/target/test':

	absolute:/home/jenkins/jenkins-slave/workspace/Hadoop-Hdfs-trunk/hadoop-hdfs-project/hadoop-hdfs/target/test
	permissions: drwx
path '/home/jenkins/jenkins-slave/workspace/Hadoop-Hdfs-trunk/hadoop-hdfs-project/hadoop-hdfs/target':

	absolute:/home/jenkins/jenkins-slave/workspace/Hadoop-Hdfs-trunk/hadoop-hdfs-project/hadoop-hdfs/target
	permissions: drwx
path '/home/jenkins/jenkins-slave/workspace/Hadoop-Hdfs-trunk/hadoop-hdfs-project/hadoop-hdfs':

	absolute:/home/jenkins/jenkins-slave/workspace/Hadoop-Hdfs-trunk/hadoop-hdfs-project/hadoop-hdfs
	permissions: drwx
path '/home/jenkins/jenkins-slave/workspace/Hadoop-Hdfs-trunk/hadoop-hdfs-project': 
	absolute:/home/jenkins/jenkins-slave/workspace/Hadoop-Hdfs-trunk/hadoop-hdfs-project
	permissions: drwx
path '/home/jenkins/jenkins-slave/workspace/Hadoop-Hdfs-trunk': 
	absolute:/home/jenkins/jenkins-slave/workspace/Hadoop-Hdfs-trunk
	permissions: drwx
path '/home/jenkins/jenkins-slave/workspace': 
	absolute:/home/jenkins/jenkins-slave/workspace
	permissions: drwx
path '/home/jenkins/jenkins-slave': 
	absolute:/home/jenkins/jenkins-slave
	permissions: drwx
path '/home/jenkins': 
	absolute:/home/jenkins
	permissions: drwx
path '/home': 
	absolute:/home
	permissions: dr-x
path '/': 
	absolute:/
	permissions: dr-x

	at org.apache.hadoop.hdfs.MiniDFSCluster.initMiniDFSCluster(MiniDFSCluster.java:834)
	at org.apache.hadoop.hdfs.MiniDFSCluster.<init>(MiniDFSCluster.java:482)
	at org.apache.hadoop.hdfs.MiniDFSCluster$Builder.build(MiniDFSCluster.java:441)
	at org.apache.hadoop.hdfs.TestAsyncDFSRename.testCallGetReturnValueMultipleTimes(TestAsyncDFSRename.java:124)


FAILED:  org.apache.hadoop.hdfs.TestAsyncDFSRename.testConservativeConcurrentAsyncRenameWithOverwrite

Error Message:
Cannot remove data directory: /home/jenkins/jenkins-slave/workspace/Hadoop-Hdfs-trunk/hadoop-hdfs-project/hadoop-hdfs/target/test/data/4/dfs/datapath
'/home/jenkins/jenkins-slave/workspace/Hadoop-Hdfs-trunk/hadoop-hdfs-project/hadoop-hdfs/target/test/data/4/dfs/data':

 absolute:/home/jenkins/jenkins-slave/workspace/Hadoop-Hdfs-trunk/hadoop-hdfs-project/hadoop-hdfs/target/test/data/4/dfs/data
 permissions: drwx
path '/home/jenkins/jenkins-slave/workspace/Hadoop-Hdfs-trunk/hadoop-hdfs-project/hadoop-hdfs/target/test/data/4/dfs':

 absolute:/home/jenkins/jenkins-slave/workspace/Hadoop-Hdfs-trunk/hadoop-hdfs-project/hadoop-hdfs/target/test/data/4/dfs
 permissions: drwx
path '/home/jenkins/jenkins-slave/workspace/Hadoop-Hdfs-trunk/hadoop-hdfs-project/hadoop-hdfs/target/test/data/4':

 absolute:/home/jenkins/jenkins-slave/workspace/Hadoop-Hdfs-trunk/hadoop-hdfs-project/hadoop-hdfs/target/test/data/4
 permissions: drwx
path '/home/jenkins/jenkins-slave/workspace/Hadoop-Hdfs-trunk/hadoop-hdfs-project/hadoop-hdfs/target/test/data':

 absolute:/home/jenkins/jenkins-slave/workspace/Hadoop-Hdfs-trunk/hadoop-hdfs-project/hadoop-hdfs/target/test/data
 permissions: drwx
path '/home/jenkins/jenkins-slave/workspace/Hadoop-Hdfs-trunk/hadoop-hdfs-project/hadoop-hdfs/target/test':

 absolute:/home/jenkins/jenkins-slave/workspace/Hadoop-Hdfs-trunk/hadoop-hdfs-project/hadoop-hdfs/target/test
 permissions: drwx
path '/home/jenkins/jenkins-slave/workspace/Hadoop-Hdfs-trunk/hadoop-hdfs-project/hadoop-hdfs/target':

 absolute:/home/jenkins/jenkins-slave/workspace/Hadoop-Hdfs-trunk/hadoop-hdfs-project/hadoop-hdfs/target
 permissions: drwx
path '/home/jenkins/jenkins-slave/workspace/Hadoop-Hdfs-trunk/hadoop-hdfs-project/hadoop-hdfs':

 absolute:/home/jenkins/jenkins-slave/workspace/Hadoop-Hdfs-trunk/hadoop-hdfs-project/hadoop-hdfs
 permissions: drwx
path '/home/jenkins/jenkins-slave/workspace/Hadoop-Hdfs-trunk/hadoop-hdfs-project': 
 absolute:/home/jenkins/jenkins-slave/workspace/Hadoop-Hdfs-trunk/hadoop-hdfs-project
 permissions: drwx
path '/home/jenkins/jenkins-slave/workspace/Hadoop-Hdfs-trunk': 
 absolute:/home/jenkins/jenkins-slave/workspace/Hadoop-Hdfs-trunk
 permissions: drwx
path '/home/jenkins/jenkins-slave/workspace': 
 absolute:/home/jenkins/jenkins-slave/workspace
 permissions: drwx
path '/home/jenkins/jenkins-slave': 
 absolute:/home/jenkins/jenkins-slave
 permissions: drwx
path '/home/jenkins': 
 absolute:/home/jenkins
 permissions: drwx
path '/home': 
 absolute:/home
 permissions: dr-x
path '/': 
 absolute:/
 permissions: dr-x


Stack Trace:
java.io.IOException: Cannot remove data directory: /home/jenkins/jenkins-slave/workspace/Hadoop-Hdfs-trunk/hadoop-hdfs-project/hadoop-hdfs/target/test/data/4/dfs/datapath
'/home/jenkins/jenkins-slave/workspace/Hadoop-Hdfs-trunk/hadoop-hdfs-project/hadoop-hdfs/target/test/data/4/dfs/data':

	absolute:/home/jenkins/jenkins-slave/workspace/Hadoop-Hdfs-trunk/hadoop-hdfs-project/hadoop-hdfs/target/test/data/4/dfs/data
	permissions: drwx
path '/home/jenkins/jenkins-slave/workspace/Hadoop-Hdfs-trunk/hadoop-hdfs-project/hadoop-hdfs/target/test/data/4/dfs':

	absolute:/home/jenkins/jenkins-slave/workspace/Hadoop-Hdfs-trunk/hadoop-hdfs-project/hadoop-hdfs/target/test/data/4/dfs
	permissions: drwx
path '/home/jenkins/jenkins-slave/workspace/Hadoop-Hdfs-trunk/hadoop-hdfs-project/hadoop-hdfs/target/test/data/4':

	absolute:/home/jenkins/jenkins-slave/workspace/Hadoop-Hdfs-trunk/hadoop-hdfs-project/hadoop-hdfs/target/test/data/4
	permissions: drwx
path '/home/jenkins/jenkins-slave/workspace/Hadoop-Hdfs-trunk/hadoop-hdfs-project/hadoop-hdfs/target/test/data':

	absolute:/home/jenkins/jenkins-slave/workspace/Hadoop-Hdfs-trunk/hadoop-hdfs-project/hadoop-hdfs/target/test/data
	permissions: drwx
path '/home/jenkins/jenkins-slave/workspace/Hadoop-Hdfs-trunk/hadoop-hdfs-project/hadoop-hdfs/target/test':

	absolute:/home/jenkins/jenkins-slave/workspace/Hadoop-Hdfs-trunk/hadoop-hdfs-project/hadoop-hdfs/target/test
	permissions: drwx
path '/home/jenkins/jenkins-slave/workspace/Hadoop-Hdfs-trunk/hadoop-hdfs-project/hadoop-hdfs/target':

	absolute:/home/jenkins/jenkins-slave/workspace/Hadoop-Hdfs-trunk/hadoop-hdfs-project/hadoop-hdfs/target
	permissions: drwx
path '/home/jenkins/jenkins-slave/workspace/Hadoop-Hdfs-trunk/hadoop-hdfs-project/hadoop-hdfs':

	absolute:/home/jenkins/jenkins-slave/workspace/Hadoop-Hdfs-trunk/hadoop-hdfs-project/hadoop-hdfs
	permissions: drwx
path '/home/jenkins/jenkins-slave/workspace/Hadoop-Hdfs-trunk/hadoop-hdfs-project': 
	absolute:/home/jenkins/jenkins-slave/workspace/Hadoop-Hdfs-trunk/hadoop-hdfs-project
	permissions: drwx
path '/home/jenkins/jenkins-slave/workspace/Hadoop-Hdfs-trunk': 
	absolute:/home/jenkins/jenkins-slave/workspace/Hadoop-Hdfs-trunk
	permissions: drwx
path '/home/jenkins/jenkins-slave/workspace': 
	absolute:/home/jenkins/jenkins-slave/workspace
	permissions: drwx
path '/home/jenkins/jenkins-slave': 
	absolute:/home/jenkins/jenkins-slave
	permissions: drwx
path '/home/jenkins': 
	absolute:/home/jenkins
	permissions: drwx
path '/home': 
	absolute:/home
	permissions: dr-x
path '/': 
	absolute:/
	permissions: dr-x

	at org.apache.hadoop.hdfs.MiniDFSCluster.initMiniDFSCluster(MiniDFSCluster.java:834)
	at org.apache.hadoop.hdfs.MiniDFSCluster.<init>(MiniDFSCluster.java:482)
	at org.apache.hadoop.hdfs.MiniDFSCluster$Builder.build(MiniDFSCluster.java:441)
	at org.apache.hadoop.hdfs.TestAsyncDFSRename.internalTestConcurrentAsyncRenameWithOverwrite(TestAsyncDFSRename.java:203)
	at org.apache.hadoop.hdfs.TestAsyncDFSRename.testConservativeConcurrentAsyncRenameWithOverwrite(TestAsyncDFSRename.java:191)


FAILED:  org.apache.hadoop.hdfs.TestAsyncDFSRename.testAsyncRenameWithOverwrite

Error Message:
Cannot remove data directory: /home/jenkins/jenkins-slave/workspace/Hadoop-Hdfs-trunk/hadoop-hdfs-project/hadoop-hdfs/target/test/data/4/dfs/datapath
'/home/jenkins/jenkins-slave/workspace/Hadoop-Hdfs-trunk/hadoop-hdfs-project/hadoop-hdfs/target/test/data/4/dfs/data':

 absolute:/home/jenkins/jenkins-slave/workspace/Hadoop-Hdfs-trunk/hadoop-hdfs-project/hadoop-hdfs/target/test/data/4/dfs/data
 permissions: drwx
path '/home/jenkins/jenkins-slave/workspace/Hadoop-Hdfs-trunk/hadoop-hdfs-project/hadoop-hdfs/target/test/data/4/dfs':

 absolute:/home/jenkins/jenkins-slave/workspace/Hadoop-Hdfs-trunk/hadoop-hdfs-project/hadoop-hdfs/target/test/data/4/dfs
 permissions: drwx
path '/home/jenkins/jenkins-slave/workspace/Hadoop-Hdfs-trunk/hadoop-hdfs-project/hadoop-hdfs/target/test/data/4':

 absolute:/home/jenkins/jenkins-slave/workspace/Hadoop-Hdfs-trunk/hadoop-hdfs-project/hadoop-hdfs/target/test/data/4
 permissions: drwx
path '/home/jenkins/jenkins-slave/workspace/Hadoop-Hdfs-trunk/hadoop-hdfs-project/hadoop-hdfs/target/test/data':

 absolute:/home/jenkins/jenkins-slave/workspace/Hadoop-Hdfs-trunk/hadoop-hdfs-project/hadoop-hdfs/target/test/data
 permissions: drwx
path '/home/jenkins/jenkins-slave/workspace/Hadoop-Hdfs-trunk/hadoop-hdfs-project/hadoop-hdfs/target/test':

 absolute:/home/jenkins/jenkins-slave/workspace/Hadoop-Hdfs-trunk/hadoop-hdfs-project/hadoop-hdfs/target/test
 permissions: drwx
path '/home/jenkins/jenkins-slave/workspace/Hadoop-Hdfs-trunk/hadoop-hdfs-project/hadoop-hdfs/target':

 absolute:/home/jenkins/jenkins-slave/workspace/Hadoop-Hdfs-trunk/hadoop-hdfs-project/hadoop-hdfs/target
 permissions: drwx
path '/home/jenkins/jenkins-slave/workspace/Hadoop-Hdfs-trunk/hadoop-hdfs-project/hadoop-hdfs':

 absolute:/home/jenkins/jenkins-slave/workspace/Hadoop-Hdfs-trunk/hadoop-hdfs-project/hadoop-hdfs
 permissions: drwx
path '/home/jenkins/jenkins-slave/workspace/Hadoop-Hdfs-trunk/hadoop-hdfs-project': 
 absolute:/home/jenkins/jenkins-slave/workspace/Hadoop-Hdfs-trunk/hadoop-hdfs-project
 permissions: drwx
path '/home/jenkins/jenkins-slave/workspace/Hadoop-Hdfs-trunk': 
 absolute:/home/jenkins/jenkins-slave/workspace/Hadoop-Hdfs-trunk
 permissions: drwx
path '/home/jenkins/jenkins-slave/workspace': 
 absolute:/home/jenkins/jenkins-slave/workspace
 permissions: drwx
path '/home/jenkins/jenkins-slave': 
 absolute:/home/jenkins/jenkins-slave
 permissions: drwx
path '/home/jenkins': 
 absolute:/home/jenkins
 permissions: drwx
path '/home': 
 absolute:/home
 permissions: dr-x
path '/': 
 absolute:/
 permissions: dr-x


Stack Trace:
java.io.IOException: Cannot remove data directory: /home/jenkins/jenkins-slave/workspace/Hadoop-Hdfs-trunk/hadoop-hdfs-project/hadoop-hdfs/target/test/data/4/dfs/datapath
'/home/jenkins/jenkins-slave/workspace/Hadoop-Hdfs-trunk/hadoop-hdfs-project/hadoop-hdfs/target/test/data/4/dfs/data':

	absolute:/home/jenkins/jenkins-slave/workspace/Hadoop-Hdfs-trunk/hadoop-hdfs-project/hadoop-hdfs/target/test/data/4/dfs/data
	permissions: drwx
path '/home/jenkins/jenkins-slave/workspace/Hadoop-Hdfs-trunk/hadoop-hdfs-project/hadoop-hdfs/target/test/data/4/dfs':

	absolute:/home/jenkins/jenkins-slave/workspace/Hadoop-Hdfs-trunk/hadoop-hdfs-project/hadoop-hdfs/target/test/data/4/dfs
	permissions: drwx
path '/home/jenkins/jenkins-slave/workspace/Hadoop-Hdfs-trunk/hadoop-hdfs-project/hadoop-hdfs/target/test/data/4':

	absolute:/home/jenkins/jenkins-slave/workspace/Hadoop-Hdfs-trunk/hadoop-hdfs-project/hadoop-hdfs/target/test/data/4
	permissions: drwx
path '/home/jenkins/jenkins-slave/workspace/Hadoop-Hdfs-trunk/hadoop-hdfs-project/hadoop-hdfs/target/test/data':

	absolute:/home/jenkins/jenkins-slave/workspace/Hadoop-Hdfs-trunk/hadoop-hdfs-project/hadoop-hdfs/target/test/data
	permissions: drwx
path '/home/jenkins/jenkins-slave/workspace/Hadoop-Hdfs-trunk/hadoop-hdfs-project/hadoop-hdfs/target/test':

	absolute:/home/jenkins/jenkins-slave/workspace/Hadoop-Hdfs-trunk/hadoop-hdfs-project/hadoop-hdfs/target/test
	permissions: drwx
path '/home/jenkins/jenkins-slave/workspace/Hadoop-Hdfs-trunk/hadoop-hdfs-project/hadoop-hdfs/target':

	absolute:/home/jenkins/jenkins-slave/workspace/Hadoop-Hdfs-trunk/hadoop-hdfs-project/hadoop-hdfs/target
	permissions: drwx
path '/home/jenkins/jenkins-slave/workspace/Hadoop-Hdfs-trunk/hadoop-hdfs-project/hadoop-hdfs':

	absolute:/home/jenkins/jenkins-slave/workspace/Hadoop-Hdfs-trunk/hadoop-hdfs-project/hadoop-hdfs
	permissions: drwx
path '/home/jenkins/jenkins-slave/workspace/Hadoop-Hdfs-trunk/hadoop-hdfs-project': 
	absolute:/home/jenkins/jenkins-slave/workspace/Hadoop-Hdfs-trunk/hadoop-hdfs-project
	permissions: drwx
path '/home/jenkins/jenkins-slave/workspace/Hadoop-Hdfs-trunk': 
	absolute:/home/jenkins/jenkins-slave/workspace/Hadoop-Hdfs-trunk
	permissions: drwx
path '/home/jenkins/jenkins-slave/workspace': 
	absolute:/home/jenkins/jenkins-slave/workspace
	permissions: drwx
path '/home/jenkins/jenkins-slave': 
	absolute:/home/jenkins/jenkins-slave
	permissions: drwx
path '/home/jenkins': 
	absolute:/home/jenkins
	permissions: drwx
path '/home': 
	absolute:/home
	permissions: dr-x
path '/': 
	absolute:/
	permissions: dr-x

	at org.apache.hadoop.hdfs.MiniDFSCluster.initMiniDFSCluster(MiniDFSCluster.java:834)
	at org.apache.hadoop.hdfs.MiniDFSCluster.<init>(MiniDFSCluster.java:482)
	at org.apache.hadoop.hdfs.MiniDFSCluster$Builder.build(MiniDFSCluster.java:441)
	at org.apache.hadoop.hdfs.TestAsyncDFSRename.testAsyncRenameWithOverwrite(TestAsyncDFSRename.java:56)


FAILED:  org.apache.hadoop.hdfs.TestDFSUpgradeFromImage.testUpgradeFromRel1BBWImage

Error Message:
Cannot obtain block length for LocatedBlock{BP-259951969-67.195.81.147-1462839692477:blk_7162739548153522810_1020;
getBlockSize()=1024; corrupt=false; offset=0; locs=[DatanodeInfoWithStorage[127.0.0.1:45054,DS-2e0f0ac3-cfe1-4ee3-b559-26e11d1788dc,DISK]]}

Stack Trace:
java.io.IOException: Cannot obtain block length for LocatedBlock{BP-259951969-67.195.81.147-1462839692477:blk_7162739548153522810_1020;
getBlockSize()=1024; corrupt=false; offset=0; locs=[DatanodeInfoWithStorage[127.0.0.1:45054,DS-2e0f0ac3-cfe1-4ee3-b559-26e11d1788dc,DISK]]}
	at org.apache.hadoop.hdfs.DFSInputStream.readBlockLength(DFSInputStream.java:435)
	at org.apache.hadoop.hdfs.DFSInputStream.fetchLocatedBlocksAndGetLastBlockLength(DFSInputStream.java:345)
	at org.apache.hadoop.hdfs.DFSInputStream.openInfo(DFSInputStream.java:277)
	at org.apache.hadoop.hdfs.DFSInputStream.<init>(DFSInputStream.java:267)
	at org.apache.hadoop.hdfs.DFSClient.open(DFSClient.java:1038)
	at org.apache.hadoop.hdfs.DFSClient.open(DFSClient.java:1003)
	at org.apache.hadoop.hdfs.TestDFSUpgradeFromImage.dfsOpenFileWithRetries(TestDFSUpgradeFromImage.java:178)
	at org.apache.hadoop.hdfs.TestDFSUpgradeFromImage.verifyDir(TestDFSUpgradeFromImage.java:214)
	at org.apache.hadoop.hdfs.TestDFSUpgradeFromImage.verifyFileSystem(TestDFSUpgradeFromImage.java:229)
	at org.apache.hadoop.hdfs.TestDFSUpgradeFromImage.upgradeAndVerify(TestDFSUpgradeFromImage.java:606)
	at org.apache.hadoop.hdfs.TestDFSUpgradeFromImage.testUpgradeFromRel1BBWImage(TestDFSUpgradeFromImage.java:628)


FAILED:  org.apache.hadoop.hdfs.TestEncryptionZones.testStartFileRetry

Error Message:
test timed out after 120000 milliseconds

Stack Trace:
java.lang.Exception: test timed out after 120000 milliseconds
	at sun.misc.Unsafe.park(Native Method)
	at java.util.concurrent.locks.LockSupport.park(LockSupport.java:186)
	at java.util.concurrent.locks.AbstractQueuedSynchronizer.parkAndCheckInterrupt(AbstractQueuedSynchronizer.java:834)
	at java.util.concurrent.locks.AbstractQueuedSynchronizer.doAcquireSharedInterruptibly(AbstractQueuedSynchronizer.java:994)
	at java.util.concurrent.locks.AbstractQueuedSynchronizer.acquireSharedInterruptibly(AbstractQueuedSynchronizer.java:1303)
	at java.util.concurrent.CountDownLatch.await(CountDownLatch.java:236)
	at org.apache.hadoop.hdfs.TestEncryptionZones.testStartFileRetry(TestEncryptionZones.java:1176)


FAILED:  org.apache.hadoop.hdfs.TestFileAppend.testMultipleAppends

Error Message:
Failed to replace a bad datanode on the existing pipeline due to no more good datanodes being
available to try. (Nodes: current=[DatanodeInfoWithStorage[127.0.0.1:50796,DS-717b579c-86e8-4266-9ab7-c137572d1c2e,DISK],
DatanodeInfoWithStorage[127.0.0.1:47696,DS-b340a7cc-080a-4ef5-acfe-57a8a8dafd5b,DISK]], original=[DatanodeInfoWithStorage[127.0.0.1:50796,DS-717b579c-86e8-4266-9ab7-c137572d1c2e,DISK],
DatanodeInfoWithStorage[127.0.0.1:47696,DS-b340a7cc-080a-4ef5-acfe-57a8a8dafd5b,DISK]]). The
current failed datanode replacement policy is DEFAULT, and a client may configure this via
'dfs.client.block.write.replace-datanode-on-failure.policy' in its configuration.

Stack Trace:
java.io.IOException: Failed to replace a bad datanode on the existing pipeline due to no more
good datanodes being available to try. (Nodes: current=[DatanodeInfoWithStorage[127.0.0.1:50796,DS-717b579c-86e8-4266-9ab7-c137572d1c2e,DISK],
DatanodeInfoWithStorage[127.0.0.1:47696,DS-b340a7cc-080a-4ef5-acfe-57a8a8dafd5b,DISK]], original=[DatanodeInfoWithStorage[127.0.0.1:50796,DS-717b579c-86e8-4266-9ab7-c137572d1c2e,DISK],
DatanodeInfoWithStorage[127.0.0.1:47696,DS-b340a7cc-080a-4ef5-acfe-57a8a8dafd5b,DISK]]). The
current failed datanode replacement policy is DEFAULT, and a client may configure this via
'dfs.client.block.write.replace-datanode-on-failure.policy' in its configuration.
	at org.apache.hadoop.hdfs.DataStreamer.findNewDatanode(DataStreamer.java:1166)
	at org.apache.hadoop.hdfs.DataStreamer.addDatanode2ExistingPipeline(DataStreamer.java:1236)
	at org.apache.hadoop.hdfs.DataStreamer.handleDatanodeReplacement(DataStreamer.java:1427)
	at org.apache.hadoop.hdfs.DataStreamer.setupPipelineInternal(DataStreamer.java:1342)
	at org.apache.hadoop.hdfs.DataStreamer.setupPipelineForAppendOrRecovery(DataStreamer.java:1325)
	at org.apache.hadoop.hdfs.DataStreamer.run(DataStreamer.java:603)


FAILED:  org.apache.hadoop.hdfs.server.datanode.TestDataNodeHotSwapVolumes.testRemoveVolumeBeingWritten

Error Message:
expected:<0> but was:<5264805314>

Stack Trace:
java.lang.AssertionError: expected:<0> but was:<5264805314>
	at org.junit.Assert.fail(Assert.java:88)
	at org.junit.Assert.failNotEquals(Assert.java:743)
	at org.junit.Assert.assertEquals(Assert.java:118)
	at org.junit.Assert.assertEquals(Assert.java:555)
	at org.junit.Assert.assertEquals(Assert.java:542)
	at org.apache.hadoop.hdfs.server.datanode.TestDataNodeHotSwapVolumes.testRemoveVolumeBeingWrittenForDatanode(TestDataNodeHotSwapVolumes.java:694)
	at org.apache.hadoop.hdfs.server.datanode.TestDataNodeHotSwapVolumes.testRemoveVolumeBeingWritten(TestDataNodeHotSwapVolumes.java:609)


FAILED:  org.apache.hadoop.hdfs.server.datanode.TestDataNodeUUID.testUUIDRegeneration

Error Message:
test timed out after 10000 milliseconds

Stack Trace:
java.lang.Exception: test timed out after 10000 milliseconds
	at org.apache.hadoop.util.Shell.runCommand(Shell.java:979)
	at org.apache.hadoop.util.Shell.run(Shell.java:850)
	at org.apache.hadoop.util.Shell$ShellCommandExecutor.execute(Shell.java:1144)
	at org.apache.hadoop.util.Shell.execCommand(Shell.java:1238)
	at org.apache.hadoop.util.Shell.execCommand(Shell.java:1220)
	at org.apache.hadoop.fs.FileUtil.execCommand(FileUtil.java:1040)
	at org.apache.hadoop.fs.RawLocalFileSystem$DeprecatedRawLocalFileStatus.loadPermissionInfo(RawLocalFileSystem.java:715)
	at org.apache.hadoop.fs.RawLocalFileSystem$DeprecatedRawLocalFileStatus.getPermission(RawLocalFileSystem.java:690)
	at org.apache.hadoop.util.DiskChecker.mkdirsWithExistsAndPermissionCheck(DiskChecker.java:155)
	at org.apache.hadoop.util.DiskChecker.checkDir(DiskChecker.java:172)
	at org.apache.hadoop.hdfs.server.datanode.DataNode$DataNodeDiskChecker.checkDir(DataNode.java:2555)
	at org.apache.hadoop.hdfs.server.datanode.DataNode.checkStorageLocations(DataNode.java:2597)
	at org.apache.hadoop.hdfs.server.datanode.DataNode.makeInstance(DataNode.java:2579)
	at org.apache.hadoop.hdfs.server.datanode.DataNode.instantiateDataNode(DataNode.java:2472)
	at org.apache.hadoop.hdfs.server.datanode.DataNode.createDataNode(DataNode.java:2519)
	at org.apache.hadoop.hdfs.MiniDFSCluster.restartDataNode(MiniDFSCluster.java:2242)
	at org.apache.hadoop.hdfs.MiniDFSCluster.restartDataNode(MiniDFSCluster.java:2219)
	at org.apache.hadoop.hdfs.server.datanode.TestDataNodeUUID.testUUIDRegeneration(TestDataNodeUUID.java:102)


FAILED:  org.apache.hadoop.hdfs.server.datanode.TestDirectoryScanner.testThrottling

Error Message:
Throttle is too permissive

Stack Trace:
java.lang.AssertionError: Throttle is too permissive
	at org.junit.Assert.fail(Assert.java:88)
	at org.junit.Assert.assertTrue(Assert.java:41)
	at org.apache.hadoop.hdfs.server.datanode.TestDirectoryScanner.testThrottling(TestDirectoryScanner.java:701)


FAILED:  org.apache.hadoop.hdfs.server.namenode.TestNamenodeCapacityReport.testXceiverCount

Error Message:
expected:<20.0> but was:<21.0>

Stack Trace:
java.lang.AssertionError: expected:<20.0> but was:<21.0>
	at org.junit.Assert.fail(Assert.java:88)
	at org.junit.Assert.failNotEquals(Assert.java:743)
	at org.junit.Assert.assertEquals(Assert.java:494)
	at org.junit.Assert.assertEquals(Assert.java:592)
	at org.apache.hadoop.hdfs.server.namenode.TestNamenodeCapacityReport.checkClusterHealth(TestNamenodeCapacityReport.java:320)
	at org.apache.hadoop.hdfs.server.namenode.TestNamenodeCapacityReport.testXceiverCount(TestNamenodeCapacityReport.java:280)


FAILED:  org.apache.hadoop.hdfs.server.namenode.ha.TestStandbyCheckpoints.testReadsAllowedDuringCheckpoint

Error Message:

Unfinished stubbing detected here:
-> at org.apache.hadoop.hdfs.server.namenode.ha.TestStandbyCheckpoints.testReadsAllowedDuringCheckpoint(TestStandbyCheckpoints.java:411)

E.g. thenReturn() may be missing.
Examples of correct stubbing:
    when(mock.isOk()).thenReturn(true);
    when(mock.isOk()).thenThrow(exception);
    doThrow(exception).when(mock).someVoidMethod();
Hints:
 1. missing thenReturn()
 2. although stubbed methods may return mocks, you cannot inline mock creation (mock()) call
inside a thenReturn method (see issue 53)


Stack Trace:
org.mockito.exceptions.misusing.UnfinishedStubbingException: 
Unfinished stubbing detected here:
-> at org.apache.hadoop.hdfs.server.namenode.ha.TestStandbyCheckpoints.testReadsAllowedDuringCheckpoint(TestStandbyCheckpoints.java:411)

E.g. thenReturn() may be missing.
Examples of correct stubbing:
    when(mock.isOk()).thenReturn(true);
    when(mock.isOk()).thenThrow(exception);
    doThrow(exception).when(mock).someVoidMethod();
Hints:
 1. missing thenReturn()
 2. although stubbed methods may return mocks, you cannot inline mock creation (mock()) call
inside a thenReturn method (see issue 53)

	at org.apache.hadoop.hdfs.server.namenode.ha.TestStandbyCheckpoints.testReadsAllowedDuringCheckpoint(TestStandbyCheckpoints.java:411)


FAILED:  org.apache.hadoop.metrics2.sink.TestRollingFileSystemSinkWithSecureHdfs.testMissingPropertiesWithSecureHDFS

Error Message:
Failed on local exception: java.io.IOException: javax.security.sasl.SaslException: GSS initiate
failed [Caused by GSSException: No valid credentials provided (Mechanism level: Connection
reset)]; Host Details : local host is: "asf903.gq1.ygridcore.net/67.195.81.147"; destination
host is: "localhost":60092; 

Stack Trace:
java.io.IOException: Failed on local exception: java.io.IOException: javax.security.sasl.SaslException:
GSS initiate failed [Caused by GSSException: No valid credentials provided (Mechanism level:
Connection reset)]; Host Details : local host is: "asf903.gq1.ygridcore.net/67.195.81.147";
destination host is: "localhost":60092; 
	at java.net.SocketInputStream.read(SocketInputStream.java:196)
	at java.net.SocketInputStream.read(SocketInputStream.java:122)
	at java.io.BufferedInputStream.fill(BufferedInputStream.java:235)
	at java.io.BufferedInputStream.read1(BufferedInputStream.java:275)
	at java.io.BufferedInputStream.read(BufferedInputStream.java:334)
	at sun.security.krb5.internal.TCPClient.readFully(NetClient.java:132)
	at sun.security.krb5.internal.TCPClient.receive(NetClient.java:84)
	at sun.security.krb5.KdcComm$KdcCommunication.run(KdcComm.java:390)
	at sun.security.krb5.KdcComm$KdcCommunication.run(KdcComm.java:343)
	at java.security.AccessController.doPrivileged(Native Method)
	at sun.security.krb5.KdcComm.send(KdcComm.java:327)
	at sun.security.krb5.KdcComm.send(KdcComm.java:219)
	at sun.security.krb5.KdcComm.send(KdcComm.java:191)
	at sun.security.krb5.KrbTgsReq.send(KrbTgsReq.java:187)
	at sun.security.krb5.KrbTgsReq.sendAndGetCreds(KrbTgsReq.java:202)
	at sun.security.krb5.internal.CredentialsUtil.serviceCreds(CredentialsUtil.java:311)
	at sun.security.krb5.internal.CredentialsUtil.acquireServiceCreds(CredentialsUtil.java:115)
	at sun.security.krb5.Credentials.acquireServiceCreds(Credentials.java:449)
	at sun.security.jgss.krb5.Krb5Context.initSecContext(Krb5Context.java:641)
	at sun.security.jgss.GSSContextImpl.initSecContext(GSSContextImpl.java:248)
	at sun.security.jgss.GSSContextImpl.initSecContext(GSSContextImpl.java:179)
	at com.sun.security.sasl.gsskerb.GssKrb5Client.evaluateChallenge(GssKrb5Client.java:193)
	at org.apache.hadoop.security.SaslRpcClient.saslConnect(SaslRpcClient.java:411)
	at org.apache.hadoop.ipc.Client$Connection.setupSaslConnection(Client.java:617)
	at org.apache.hadoop.ipc.Client$Connection.access$2000(Client.java:417)
	at org.apache.hadoop.ipc.Client$Connection$2.run(Client.java:799)
	at org.apache.hadoop.ipc.Client$Connection$2.run(Client.java:795)
	at java.security.AccessController.doPrivileged(Native Method)
	at javax.security.auth.Subject.doAs(Subject.java:415)
	at org.apache.hadoop.security.UserGroupInformation.doAs(UserGroupInformation.java:1755)
	at org.apache.hadoop.ipc.Client$Connection.setupIOstreams(Client.java:794)
	at org.apache.hadoop.ipc.Client$Connection.access$3200(Client.java:417)
	at org.apache.hadoop.ipc.Client.getConnection(Client.java:1547)
	at org.apache.hadoop.ipc.Client.call(Client.java:1394)
	at org.apache.hadoop.ipc.Client.call(Client.java:1358)
	at org.apache.hadoop.ipc.ProtobufRpcEngine$Invoker.invoke(ProtobufRpcEngine.java:241)
	at com.sun.proxy.$Proxy25.mkdirs(Unknown Source)
	at org.apache.hadoop.hdfs.protocolPB.ClientNamenodeProtocolTranslatorPB.mkdirs(ClientNamenodeProtocolTranslatorPB.java:569)
	at sun.reflect.NativeMethodAccessorImpl.invoke0(Native Method)
	at sun.reflect.NativeMethodAccessorImpl.invoke(NativeMethodAccessorImpl.java:57)
	at sun.reflect.DelegatingMethodAccessorImpl.invoke(DelegatingMethodAccessorImpl.java:43)
	at java.lang.reflect.Method.invoke(Method.java:606)
	at org.apache.hadoop.io.retry.RetryInvocationHandler.invokeMethod(RetryInvocationHandler.java:257)
	at org.apache.hadoop.io.retry.RetryInvocationHandler.invoke(RetryInvocationHandler.java:103)
	at com.sun.proxy.$Proxy27.mkdirs(Unknown Source)
	at org.apache.hadoop.hdfs.DFSClient.primitiveMkdir(DFSClient.java:2302)
	at org.apache.hadoop.hdfs.DFSClient.mkdirs(DFSClient.java:2277)
	at org.apache.hadoop.hdfs.DistributedFileSystem$24.doCall(DistributedFileSystem.java:1079)
	at org.apache.hadoop.hdfs.DistributedFileSystem$24.doCall(DistributedFileSystem.java:1076)
	at org.apache.hadoop.fs.FileSystemLinkResolver.resolve(FileSystemLinkResolver.java:81)
	at org.apache.hadoop.hdfs.DistributedFileSystem.mkdirsInternal(DistributedFileSystem.java:1076)
	at org.apache.hadoop.hdfs.DistributedFileSystem.mkdirs(DistributedFileSystem.java:1069)
	at org.apache.hadoop.fs.FileSystem.mkdirs(FileSystem.java:1908)
	at org.apache.hadoop.metrics2.sink.TestRollingFileSystemSinkWithSecureHdfs.createDirectoriesSecurely(TestRollingFileSystemSinkWithSecureHdfs.java:206)
	at org.apache.hadoop.metrics2.sink.TestRollingFileSystemSinkWithSecureHdfs.testMissingPropertiesWithSecureHDFS(TestRollingFileSystemSinkWithSecureHdfs.java:146)




Mime
View raw message