hadoop-hdfs-dev mailing list archives

Site index · List index
Message view « Date » · « Thread »
Top « Date » · « Thread »
From Apache Jenkins Server <jenk...@builds.apache.org>
Subject Build failed in Jenkins: Hadoop-Hdfs-trunk-Java8 #1193
Date Wed, 11 May 2016 19:15:18 GMT
See <https://builds.apache.org/job/Hadoop-Hdfs-trunk-Java8/1193/changes>

Changes:

[junping_du] YARN-5029. RM needs to send update event with YarnApplicationState as

------------------------------------------
[...truncated 10792 lines...]
"Socket Reader #1 for port 42789"  prio=5 tid=45 runnable
java.lang.Thread.State: RUNNABLE
        at sun.nio.ch.EPollArrayWrapper.epollWait(Native Method)
        at sun.nio.ch.EPollArrayWrapper.poll(EPollArrayWrapper.java:269)
        at sun.nio.ch.EPollSelectorImpl.doSelect(EPollSelectorImpl.java:79)
        at sun.nio.ch.SelectorImpl.lockAndDoSelect(SelectorImpl.java:86)
        at sun.nio.ch.SelectorImpl.select(SelectorImpl.java:97)
        at sun.nio.ch.SelectorImpl.select(SelectorImpl.java:101)
        at org.apache.hadoop.ipc.Server$Listener$Reader.doRunLoop(Server.java:848)
        at org.apache.hadoop.ipc.Server$Listener$Reader.run(Server.java:827)
"nioEventLoopGroup-20-4"  prio=10 tid=574 runnable
java.lang.Thread.State: RUNNABLE
        at java.lang.Thread.sleep(Native Method)
        at io.netty.util.concurrent.SingleThreadEventExecutor.confirmShutdown(SingleThreadEventExecutor.java:614)
        at io.netty.channel.nio.NioEventLoop.run(NioEventLoop.java:361)
        at io.netty.util.concurrent.SingleThreadEventExecutor$4.run(SingleThreadEventExecutor.java:703)
        at io.netty.util.concurrent.DefaultThreadFactory$DefaultRunnableDecorator.run(DefaultThreadFactory.java:137)
        at java.lang.Thread.run(Thread.java:744)
"IPC Server handler 3 on 48070" daemon prio=5 tid=222 timed_waiting
java.lang.Thread.State: TIMED_WAITING
        at sun.misc.Unsafe.park(Native Method)
        at java.util.concurrent.locks.LockSupport.parkNanos(LockSupport.java:215)
        at java.util.concurrent.locks.AbstractQueuedSynchronizer$ConditionObject.awaitNanos(AbstractQueuedSynchronizer.java:2078)
        at java.util.concurrent.LinkedBlockingQueue.poll(LinkedBlockingQueue.java:467)
        at org.apache.hadoop.ipc.CallQueueManager.take(CallQueueManager.java:218)
        at org.apache.hadoop.ipc.Server$Handler.run(Server.java:2387)
"pool-16-thread-1"  prio=5 tid=188 timed_waiting
java.lang.Thread.State: TIMED_WAITING
        at sun.misc.Unsafe.park(Native Method)
        at java.util.concurrent.locks.LockSupport.parkNanos(LockSupport.java:215)
        at java.util.concurrent.locks.AbstractQueuedSynchronizer$ConditionObject.awaitNanos(AbstractQueuedSynchronizer.java:2078)
        at java.util.concurrent.ScheduledThreadPoolExecutor$DelayedWorkQueue.take(ScheduledThreadPoolExecutor.java:1093)
        at java.util.concurrent.ScheduledThreadPoolExecutor$DelayedWorkQueue.take(ScheduledThreadPoolExecutor.java:809)
        at java.util.concurrent.ThreadPoolExecutor.getTask(ThreadPoolExecutor.java:1067)
        at java.util.concurrent.ThreadPoolExecutor.runWorker(ThreadPoolExecutor.java:1127)
        at java.util.concurrent.ThreadPoolExecutor$Worker.run(ThreadPoolExecutor.java:617)
        at java.lang.Thread.run(Thread.java:744)
"Socket Reader #1 for port 53527"  prio=5 tid=345 runnable
java.lang.Thread.State: RUNNABLE
        at sun.nio.ch.EPollArrayWrapper.epollWait(Native Method)
        at sun.nio.ch.EPollArrayWrapper.poll(EPollArrayWrapper.java:269)
Tests run: 4, Failures: 0, Errors: 1, Skipped: 0, Time elapsed: 74.044 sec <<< FAILURE!
- in org.apache.hadoop.hdfs.TestCrcCorruption
testCorruptionDuringWrt(org.apache.hadoop.hdfs.TestCrcCorruption)  Time elapsed: 50.391 sec
 <<< ERROR!
java.lang.Exception: test timed out after 50000 milliseconds
	at java.lang.Object.wait(Native Method)
	at org.apache.hadoop.hdfs.DataStreamer.waitForAckedSeqno(DataStreamer.java:768)
	at org.apache.hadoop.hdfs.DFSOutputStream.flushInternal(DFSOutputStream.java:697)
	at org.apache.hadoop.hdfs.DFSOutputStream.closeImpl(DFSOutputStream.java:778)
	at org.apache.hadoop.hdfs.DFSOutputStream.close(DFSOutputStream.java:755)
	at org.apache.hadoop.fs.FSDataOutputStream$PositionCache.close(FSDataOutputStream.java:72)
	at org.apache.hadoop.fs.FSDataOutputStream.close(FSDataOutputStream.java:101)
	at org.apache.hadoop.hdfs.TestCrcCorruption.testCorruptionDuringWrt(TestCrcCorruption.java:136)

        at sun.nio.ch.EPollSelectorImpl.doSelec
Java HotSpot(TM) 64-Bit Server VM warning: ignoring option MaxPermSize=768m; support was removed
in 8.0
Running org.apache.hadoop.hdfs.TestParallelReadUtil
Tests run: 1, Failures: 0, Errors: 0, Skipped: 1, Time elapsed: 0.038 sec - in org.apache.hadoop.hdfs.TestParallelReadUtil
Java HotSpot(TM) 64-Bit Server VM warning: ignoring option MaxPermSize=768m; support was removed
in 8.0
Running org.apache.hadoop.hdfs.TestDFSUpgrade
Tests run: 20, Failures: 0, Errors: 0, Skipped: 0, Time elapsed: 57.457 sec - in org.apache.hadoop.hdfs.TestBlockStoragePolicy
Java HotSpot(TM) 64-Bit Server VM warning: ignoring option MaxPermSize=768m; support was removed
in 8.0
Running org.apache.hadoop.hdfs.TestDFSShell
Tests run: 2, Failures: 0, Errors: 0, Skipped: 0, Time elapsed: 27.015 sec - in org.apache.hadoop.hdfs.TestDFSUpgrade
Java HotSpot(TM) 64-Bit Server VM warning: ignoring option MaxPermSize=768m; support was removed
in 8.0
Running org.apache.hadoop.hdfs.TestFileAppend2
Tests run: 4, Failures: 0, Errors: 0, Skipped: 0, Time elapsed: 78.127 sec - in org.apache.hadoop.hdfs.TestDatanodeDeath
Java HotSpot(TM) 64-Bit Server VM warning: ignoring option MaxPermSize=768m; support was removed
in 8.0
Running org.apache.hadoop.hdfs.TestKeyProviderCache
Tests run: 1, Failures: 0, Errors: 0, Skipped: 0, Time elapsed: 1.671 sec - in org.apache.hadoop.hdfs.TestKeyProviderCache
Java HotSpot(TM) 64-Bit Server VM warning: ignoring option MaxPermSize=768m; support was removed
in 8.0
Running org.apache.hadoop.hdfs.TestListFilesInDFS
Tests run: 2, Failures: 0, Errors: 0, Skipped: 0, Time elapsed: 11.674 sec - in org.apache.hadoop.hdfs.TestListFilesInDFS
Java HotSpot(TM) 64-Bit Server VM warning: ignoring option MaxPermSize=768m; support was removed
in 8.0
Running org.apache.hadoop.hdfs.TestDFSStripedOutputStreamWithFailure160
Tests run: 43, Failures: 0, Errors: 0, Skipped: 0, Time elapsed: 77.096 sec - in org.apache.hadoop.hdfs.TestDFSShell
Java HotSpot(TM) 64-Bit Server VM warning: ignoring option MaxPermSize=768m; support was removed
in 8.0
Tests run: 44, Failures: 0, Errors: 0, Skipped: 0, Time elapsed: 156.326 sec - in org.apache.hadoop.hdfs.TestHDFSFileSystemContract
Java HotSpot(TM) 64-Bit Server VM warning: ignoring option MaxPermSize=768m; support was removed
in 8.0
Running org.apache.hadoop.hdfs.TestAppendSnapshotTruncate
Running org.apache.hadoop.hdfs.TestDFSStripedOutputStreamWithFailure150
Tests run: 5, Failures: 0, Errors: 0, Skipped: 0, Time elapsed: 59.84 sec - in org.apache.hadoop.hdfs.TestFileAppend2
Java HotSpot(TM) 64-Bit Server VM warning: ignoring option MaxPermSize=768m; support was removed
in 8.0
Running org.apache.hadoop.hdfs.TestDFSOutputStream
Tests run: 4, Failures: 0, Errors: 0, Skipped: 0, Time elapsed: 17.431 sec - in org.apache.hadoop.hdfs.TestDFSOutputStream
Java HotSpot(TM) 64-Bit Server VM warning: ignoring option MaxPermSize=768m; support was removed
in 8.0
Running org.apache.hadoop.hdfs.TestHDFSServerPorts
Tests run: 1, Failures: 0, Errors: 0, Skipped: 0, Time elapsed: 39.706 sec - in org.apache.hadoop.hdfs.TestAppendSnapshotTruncate
Tests run: 4, Failures: 0, Errors: 0, Skipped: 0, Time elapsed: 15.888 sec - in org.apache.hadoop.hdfs.TestHDFSServerPorts
Java HotSpot(TM) 64-Bit Server VM warning: ignoring option MaxPermSize=768m; support was removed
in 8.0
Java HotSpot(TM) 64-Bit Server VM warning: ignoring option MaxPermSize=768m; support was removed
in 8.0
Running org.apache.hadoop.hdfs.TestDFSStripedOutputStreamWithFailure060
Running org.apache.hadoop.hdfs.TestDFSClientExcludedNodes
Tests run: 10, Failures: 0, Errors: 0, Skipped: 0, Time elapsed: 0.646 sec - in org.apache.hadoop.hdfs.TestDFSStripedOutputStreamWithFailure060
Java HotSpot(TM) 64-Bit Server VM warning: ignoring option MaxPermSize=768m; support was removed
in 8.0
Running org.apache.hadoop.hdfs.TestDFSPermission
Tests run: 10, Failures: 0, Errors: 0, Skipped: 0, Time elapsed: 85.174 sec - in org.apache.hadoop.hdfs.TestDFSStripedOutputStreamWithFailure160
Java HotSpot(TM) 64-Bit Server VM warning: ignoring option MaxPermSize=768m; support was removed
in 8.0
Running org.apache.hadoop.hdfs.TestRestartDFS
Tests run: 2, Failures: 0, Errors: 0, Skipped: 0, Time elapsed: 22.258 sec - in org.apache.hadoop.hdfs.TestDFSClientExcludedNodes
Java HotSpot(TM) 64-Bit Server VM warning: ignoring option MaxPermSize=768m; support was removed
in 8.0
Running org.apache.hadoop.cli.TestCryptoAdminCLI
Tests run: 1, Failures: 0, Errors: 0, Skipped: 0, Time elapsed: 15.938 sec - in org.apache.hadoop.cli.TestCryptoAdminCLI
Tests run: 10, Failures: 0, Errors: 0, Skipped: 0, Time elapsed: 79.533 sec - in org.apache.hadoop.hdfs.TestDFSStripedOutputStreamWithFailure150
Java HotSpot(TM) 64-Bit Server VM warning: ignoring option MaxPermSize=768m; support was removed
in 8.0
Java HotSpot(TM) 64-Bit Server VM warning: ignoring option MaxPermSize=768m; support was removed
in 8.0
Running org.apache.hadoop.cli.TestHDFSCLI
Running org.apache.hadoop.cli.TestAclCLI
Tests run: 8, Failures: 0, Errors: 0, Skipped: 0, Time elapsed: 44.919 sec - in org.apache.hadoop.hdfs.TestDFSPermission
Java HotSpot(TM) 64-Bit Server VM warning: ignoring option MaxPermSize=768m; support was removed
in 8.0
Running org.apache.hadoop.cli.TestDeleteCLI
Tests run: 2, Failures: 0, Errors: 0, Skipped: 0, Time elapsed: 34.743 sec - in org.apache.hadoop.hdfs.TestRestartDFS
Java HotSpot(TM) 64-Bit Server VM warning: ignoring option MaxPermSize=768m; support was removed
in 8.0
Running org.apache.hadoop.cli.TestCacheAdminCLI
Tests run: 1, Failures: 0, Errors: 0, Skipped: 0, Time elapsed: 13.325 sec - in org.apache.hadoop.cli.TestAclCLI
Java HotSpot(TM) 64-Bit Server VM warning: ignoring option MaxPermSize=768m; support was removed
in 8.0
Running org.apache.hadoop.cli.TestErasureCodingCLI
Tests run: 1, Failures: 0, Errors: 0, Skipped: 0, Time elapsed: 15.025 sec - in org.apache.hadoop.cli.TestDeleteCLI
Java HotSpot(TM) 64-Bit Server VM warning: ignoring option MaxPermSize=768m; support was removed
in 8.0
Running org.apache.hadoop.cli.TestXAttrCLI
Tests run: 1, Failures: 0, Errors: 0, Skipped: 0, Time elapsed: 13.827 sec - in org.apache.hadoop.cli.TestCacheAdminCLI
Java HotSpot(TM) 64-Bit Server VM warning: ignoring option MaxPermSize=768m; support was removed
in 8.0
Running org.apache.hadoop.TestRefreshCallQueue
Tests run: 1, Failures: 0, Errors: 0, Skipped: 0, Time elapsed: 14.06 sec - in org.apache.hadoop.cli.TestErasureCodingCLI
Java HotSpot(TM) 64-Bit Server VM warning: ignoring option MaxPermSize=768m; support was removed
in 8.0
Running org.apache.hadoop.security.TestPermissionSymlinks
Tests run: 1, Failures: 0, Errors: 0, Skipped: 0, Time elapsed: 12.586 sec - in org.apache.hadoop.cli.TestXAttrCLI
Java HotSpot(TM) 64-Bit Server VM warning: ignoring option MaxPermSize=768m; support was removed
in 8.0
Running org.apache.hadoop.security.TestPermission
Tests run: 1, Failures: 0, Errors: 0, Skipped: 0, Time elapsed: 9.277 sec - in org.apache.hadoop.TestRefreshCallQueue
Java HotSpot(TM) 64-Bit Server VM warning: ignoring option MaxPermSize=768m; support was removed
in 8.0
Running org.apache.hadoop.security.TestRefreshUserMappings
Tests run: 15, Failures: 0, Errors: 0, Skipped: 0, Time elapsed: 12.866 sec - in org.apache.hadoop.security.TestPermissionSymlinks
Tests run: 2, Failures: 0, Errors: 0, Skipped: 0, Time elapsed: 10.947 sec - in org.apache.hadoop.security.TestRefreshUserMappings
Tests run: 3, Failures: 0, Errors: 0, Skipped: 0, Time elapsed: 13.518 sec - in org.apache.hadoop.security.TestPermission
Tests run: 1, Failures: 0, Errors: 0, Skipped: 0, Time elapsed: 82.44 sec - in org.apache.hadoop.cli.TestHDFSCLI

Results :

Failed tests: 
  TestDecommissioningStatus.testDecommissionStatus:291->checkDecommissionStatus:196 Unexpected
num under-replicated blocks expected:<3> but was:<4>
  TestEditLog.testBatchedSyncWithClosedLogs:594 logging edit without syncing should do not
affect txid expected:<1> but was:<2>
  TestDirectoryScanner.testThrottling:701 Throttle is too permissive

Tests in error: 
  TestFileAppend.testMultipleAppends » IO Failed to replace a bad datanode on th...
  TestAsyncDFSRename.testConservativeConcurrentAsyncRenameWithOverwrite:191->internalTestConcurrentAsyncRenameWithOverwrite:220->Object.wait:-2
» 
  TestDataNodeHotSwapVolumes.testAddVolumeFailures:530->startDFSCluster:124 » NoClassDefFound
  TestDataNodeHotSwapVolumes.testParseChangedVolumes:214->startDFSCluster:124 » NoClassDefFound
  TestDataNodeHotSwapVolumes.testDirectlyReloadAfterCheckDiskError:768->startDFSCluster:124
» NoClassDefFound
  TestDataNodeHotSwapVolumes.testParseChangedVolumesFailures:249->startDFSCluster:124 »
NoClassDefFound
  TestDataNodeHotSwapVolumes.testReplicatingAfterRemoveVolume:488->startDFSCluster:124
» NoClassDefFound
  TestDataNodeHotSwapVolumes.testFullBlockReportAfterRemovingVolumes:820 » NoClassDefFound
  TestDataNodeHotSwapVolumes.testRemoveVolumeBeingWritten:609->testRemoveVolumeBeingWrittenForDatanode:622->startDFSCluster:124
» NoClassDefFound
  TestDataNodeHotSwapVolumes.testRemoveOneVolume:446->startDFSCluster:124 » NoClassDefFound
  TestDataNodeHotSwapVolumes.testAddVolumesDuringWrite:379->startDFSCluster:124 » NoClassDefFound
  TestDataNodeHotSwapVolumes.testAddBackRemovedVolume:705->startDFSCluster:124 » NoClassDefFound
  TestDataNodeHotSwapVolumes.testAddVolumesToFederationNN:415->startDFSCluster:124 » NoClassDefFound
  TestDataNodeHotSwapVolumes.testAddOneNewVolume:349->startDFSCluster:124 » NoClassDefFound
  TestDataNodeUGIProvider.testUGICacheSecure:86->getWebHdfsFileSystem:210 » NoClassDefFound
  TestDataNodeUUID.testUUIDRegeneration:90 »  test timed out after 10000 millise...
  TestDelegationTokenForProxyUser.testWebHdfsDoAs:180 »  test timed out after 50...
  TestCrcCorruption.testCorruptionDuringWrt:136->Object.wait:-2 »  test timed ou...

Tests run: 4415, Failures: 3, Errors: 18, Skipped: 17

[INFO]                                                                         
[INFO] ------------------------------------------------------------------------
[INFO] Skipping Apache Hadoop HDFS Native Client
[INFO] This project has been banned from the build due to previous failures.
[INFO] ------------------------------------------------------------------------
[INFO]                                                                         
[INFO] ------------------------------------------------------------------------
[INFO] Skipping Apache Hadoop HttpFS
[INFO] This project has been banned from the build due to previous failures.
[INFO] ------------------------------------------------------------------------
[INFO]                                                                         
[INFO] ------------------------------------------------------------------------
[INFO] Skipping Apache Hadoop HDFS BookKeeper Journal
[INFO] This project has been banned from the build due to previous failures.
[INFO] ------------------------------------------------------------------------
[INFO]                                                                         
[INFO] ------------------------------------------------------------------------
[INFO] Skipping Apache Hadoop HDFS-NFS
[INFO] This project has been banned from the build due to previous failures.
[INFO] ------------------------------------------------------------------------
[INFO]                                                                         
[INFO] ------------------------------------------------------------------------
[INFO] Building Apache Hadoop HDFS Project 3.0.0-SNAPSHOT
[INFO] ------------------------------------------------------------------------
[INFO] 
[INFO] --- maven-clean-plugin:2.5:clean (default-clean) @ hadoop-hdfs-project ---
[INFO] Deleting <https://builds.apache.org/job/Hadoop-Hdfs-trunk-Java8/ws/hadoop-hdfs-project/target>
[INFO] 
[INFO] --- maven-antrun-plugin:1.7:run (create-testdirs) @ hadoop-hdfs-project ---
[INFO] Executing tasks

main:
    [mkdir] Created dir: <https://builds.apache.org/job/Hadoop-Hdfs-trunk-Java8/ws/hadoop-hdfs-project/target/test-dir>
[INFO] Executed tasks
[INFO] 
[INFO] --- maven-source-plugin:2.3:jar-no-fork (hadoop-java-sources) @ hadoop-hdfs-project
---
[INFO] 
[INFO] --- maven-source-plugin:2.3:test-jar-no-fork (hadoop-java-sources) @ hadoop-hdfs-project
---
[INFO] 
[INFO] --- maven-enforcer-plugin:1.3.1:enforce (dist-enforce) @ hadoop-hdfs-project ---
[INFO] 
[INFO] --- maven-site-plugin:3.5:attach-descriptor (attach-descriptor) @ hadoop-hdfs-project
---
[INFO] 
[INFO] --- maven-javadoc-plugin:2.8.1:jar (module-javadocs) @ hadoop-hdfs-project ---
[INFO] Not executing Javadoc as the project is not a Java classpath-capable package
[INFO] 
[INFO] --- maven-enforcer-plugin:1.3.1:enforce (depcheck) @ hadoop-hdfs-project ---
[INFO] 
[INFO] --- maven-checkstyle-plugin:2.15:checkstyle (default-cli) @ hadoop-hdfs-project ---
[INFO] 
[INFO] --- findbugs-maven-plugin:3.0.0:findbugs (default-cli) @ hadoop-hdfs-project ---
[INFO] ------------------------------------------------------------------------
[INFO] Reactor Summary:
[INFO] 
[INFO] Apache Hadoop HDFS Client ......................... SUCCESS [05:51 min]
[INFO] Apache Hadoop HDFS ................................ FAILURE [  01:28 h]
[INFO] Apache Hadoop HDFS Native Client .................. SKIPPED
[INFO] Apache Hadoop HttpFS .............................. SKIPPED
[INFO] Apache Hadoop HDFS BookKeeper Journal ............. SKIPPED
[INFO] Apache Hadoop HDFS-NFS ............................ SKIPPED
[INFO] Apache Hadoop HDFS Project ........................ SUCCESS [  0.145 s]
[INFO] ------------------------------------------------------------------------
[INFO] BUILD FAILURE
[INFO] ------------------------------------------------------------------------
[INFO] Total time: 01:34 h
[INFO] Finished at: 2016-05-11T19:15:07+00:00
[INFO] Final Memory: 58M/981M
[INFO] ------------------------------------------------------------------------
[ERROR] Failed to execute goal org.apache.maven.plugins:maven-surefire-plugin:2.17:test (default-test)
on project hadoop-hdfs: There are test failures.
[ERROR] 
[ERROR] Please refer to <https://builds.apache.org/job/Hadoop-Hdfs-trunk-Java8/ws/hadoop-hdfs-project/hadoop-hdfs/target/surefire-reports>
for the individual test results.
[ERROR] -> [Help 1]
[ERROR] 
[ERROR] To see the full stack trace of the errors, re-run Maven with the -e switch.
[ERROR] Re-run Maven using the -X switch to enable full debug logging.
[ERROR] 
[ERROR] For more information about the errors and possible solutions, please read the following
articles:
[ERROR] [Help 1] http://cwiki.apache.org/confluence/display/MAVEN/MojoFailureException
[ERROR] 
[ERROR] After correcting the problems, you can resume the build with the command
[ERROR]   mvn <goals> -rf :hadoop-hdfs
Build step 'Execute shell' marked build as failure
Archiving artifacts
Recording test results

---------------------------------------------------------------------
To unsubscribe, e-mail: hdfs-dev-unsubscribe@hadoop.apache.org
For additional commands, e-mail: hdfs-dev-help@hadoop.apache.org


Mime
View raw message