hadoop-hdfs-dev mailing list archives

Site index · List index
Message view « Date » · « Thread »
Top « Date » · « Thread »
From Apache Jenkins Server <jenk...@builds.apache.org>
Subject Build failed in Jenkins: Hadoop-Hdfs-trunk-Java8 #1282
Date Sat, 28 May 2016 02:56:42 GMT
See <https://builds.apache.org/job/Hadoop-Hdfs-trunk-Java8/1282/changes>

Changes:

[Arun Suresh] YARN-5117. QueuingContainerManager does not start GUARANTEED Container

------------------------------------------
[...truncated 5286 lines...]
Tests run: 2, Failures: 0, Errors: 0, Skipped: 0, Time elapsed: 0.236 sec - in org.apache.hadoop.hdfs.util.TestBestEffortLongFile
Running org.apache.hadoop.hdfs.util.TestDiff
Tests run: 1, Failures: 0, Errors: 0, Skipped: 0, Time elapsed: 2.462 sec - in org.apache.hadoop.hdfs.util.TestDiff
Running org.apache.hadoop.hdfs.util.TestStripedBlockUtil
Tests run: 3, Failures: 0, Errors: 0, Skipped: 0, Time elapsed: 42.928 sec - in org.apache.hadoop.hdfs.TestGetBlocks
Running org.apache.hadoop.hdfs.util.TestCombinedHostsFileReader
Tests run: 2, Failures: 0, Errors: 0, Skipped: 0, Time elapsed: 0.33 sec - in org.apache.hadoop.hdfs.util.TestCombinedHostsFileReader
Running org.apache.hadoop.hdfs.util.TestXMLUtils
Tests run: 6, Failures: 0, Errors: 0, Skipped: 0, Time elapsed: 0.072 sec - in org.apache.hadoop.hdfs.util.TestXMLUtils
Running org.apache.hadoop.hdfs.util.TestLightWeightHashSet
Tests run: 14, Failures: 0, Errors: 0, Skipped: 0, Time elapsed: 0.192 sec - in org.apache.hadoop.hdfs.util.TestLightWeightHashSet
Running org.apache.hadoop.hdfs.util.TestMD5FileUtils
Tests run: 3, Failures: 0, Errors: 0, Skipped: 0, Time elapsed: 4.145 sec - in org.apache.hadoop.hdfs.util.TestStripedBlockUtil
Tests run: 5, Failures: 0, Errors: 0, Skipped: 0, Time elapsed: 0.446 sec - in org.apache.hadoop.hdfs.util.TestMD5FileUtils
Running org.apache.hadoop.hdfs.util.TestLightWeightLinkedSet
Running org.apache.hadoop.hdfs.util.TestAtomicFileOutputStream
Tests run: 17, Failures: 0, Errors: 0, Skipped: 0, Time elapsed: 0.211 sec - in org.apache.hadoop.hdfs.util.TestLightWeightLinkedSet
Running org.apache.hadoop.hdfs.TestLease
Tests run: 4, Failures: 0, Errors: 0, Skipped: 1, Time elapsed: 0.373 sec - in org.apache.hadoop.hdfs.util.TestAtomicFileOutputStream
Running org.apache.hadoop.hdfs.TestInjectionForSimulatedStorage
Tests run: 5, Failures: 0, Errors: 0, Skipped: 0, Time elapsed: 15.333 sec - in org.apache.hadoop.hdfs.TestLease
Running org.apache.hadoop.hdfs.TestHFlush
Tests run: 1, Failures: 0, Errors: 0, Skipped: 0, Time elapsed: 16.441 sec - in org.apache.hadoop.hdfs.TestInjectionForSimulatedStorage
Running org.apache.hadoop.hdfs.TestErasureCodingPolicies
Tests run: 28, Failures: 0, Errors: 0, Skipped: 0, Time elapsed: 99.675 sec - in org.apache.hadoop.hdfs.TestEncryptionZonesWithKMS
Running org.apache.hadoop.hdfs.TestHDFSPolicyProvider
Tests run: 3, Failures: 0, Errors: 0, Skipped: 0, Time elapsed: 0.229 sec - in org.apache.hadoop.hdfs.TestHDFSPolicyProvider
Running org.apache.hadoop.hdfs.TestHdfsAdmin
Tests run: 2, Failures: 0, Errors: 0, Skipped: 0, Time elapsed: 5.053 sec - in org.apache.hadoop.hdfs.TestHdfsAdmin
Running org.apache.hadoop.hdfs.TestDistributedFileSystem
Tests run: 10, Failures: 0, Errors: 0, Skipped: 0, Time elapsed: 18.707 sec - in org.apache.hadoop.hdfs.TestErasureCodingPolicies
Running org.apache.hadoop.hdfs.TestRollingUpgradeRollback
Tests run: 3, Failures: 0, Errors: 0, Skipped: 0, Time elapsed: 14.737 sec - in org.apache.hadoop.hdfs.TestRollingUpgradeRollback
Running org.apache.hadoop.hdfs.TestRollingUpgrade
Tests run: 14, Failures: 0, Errors: 0, Skipped: 0, Time elapsed: 44.302 sec - in org.apache.hadoop.hdfs.TestHFlush
Running org.apache.hadoop.hdfs.TestDatanodeDeath
Tests run: 12, Failures: 3, Errors: 0, Skipped: 0, Time elapsed: 44.527 sec <<< FAILURE!
- in org.apache.hadoop.hdfs.TestRollingUpgrade
testCheckpointWithMultipleNN(org.apache.hadoop.hdfs.TestRollingUpgrade)  Time elapsed: 4.647
sec  <<< FAILURE!
java.lang.AssertionError: Test resulted in an unexpected exit
	at org.apache.hadoop.hdfs.MiniDFSCluster.shutdown(MiniDFSCluster.java:1913)
	at org.apache.hadoop.hdfs.MiniDFSCluster.shutdown(MiniDFSCluster.java:1900)
	at org.apache.hadoop.hdfs.MiniDFSCluster.shutdown(MiniDFSCluster.java:1893)
	at org.apache.hadoop.hdfs.qjournal.MiniQJMHACluster.shutdown(MiniQJMHACluster.java:168)
	at org.apache.hadoop.hdfs.TestRollingUpgrade.testCheckpoint(TestRollingUpgrade.java:604)
	at org.apache.hadoop.hdfs.TestRollingUpgrade.testCheckpointWithMultipleNN(TestRollingUpgrade.java:568)

testDFSAdminRollingUpgradeCommands(org.apache.hadoop.hdfs.TestRollingUpgrade)  Time elapsed:
0.888 sec  <<< FAILURE!
java.lang.AssertionError: expected null, but was:<javax.management.openmbean.CompositeDataSupport(compositeType=javax.management.openmbean.CompositeType(name=org.apache.hadoop.hdfs.protocol.RollingUpgradeInfo$Bean,items=((itemName=blockPoolId,itemType=javax.management.openmbean.SimpleType(name=java.lang.String)),(itemName=createdRollbackImages,itemType=javax.management.openmbean.SimpleType(name=java.lang.Boolean)),(itemName=finalizeTime,itemType=javax.management.openmbean.SimpleType(name=java.lang.Long)),(itemName=startTime,itemType=javax.management.openmbean.SimpleType(name=java.lang.Long)))),contents={blockPoolId=BP-806886028-67.195.81.149-1464403912625,
createdRollbackImages=true, finalizeTime=0, startTime=1464403914656})>
	at org.junit.Assert.fail(Assert.java:88)
	at org.junit.Assert.failNotNull(Assert.java:664)
	at org.junit.Assert.assertNull(Assert.java:646)
	at org.junit.Assert.assertNull(Assert.java:656)
	at org.apache.hadoop.hdfs.TestRollingUpgrade.checkMxBeanIsNull(TestRollingUpgrade.java:295)
	at org.apache.hadoop.hdfs.TestRollingUpgrade.testDFSAdminRollingUpgradeCommands(TestRollingUpgrade.java:102)

testRollback(org.apache.hadoop.hdfs.TestRollingUpgrade)  Time elapsed: 1.865 sec  <<<
FAILURE!
java.lang.AssertionError: expected null, but was:<javax.management.openmbean.CompositeDataSupport(compositeType=javax.management.openmbean.CompositeType(name=org.apache.hadoop.hdfs.protocol.RollingUpgradeInfo$Bean,items=((itemName=blockPoolId,itemType=javax.management.openmbean.SimpleType(name=java.lang.String)),(itemName=createdRollbackImages,itemType=javax.management.openmbean.SimpleType(name=java.lang.Boolean)),(itemName=finalizeTime,itemType=javax.management.openmbean.SimpleType(name=java.lang.Long)),(itemName=startTime,itemType=javax.management.openmbean.SimpleType(name=java.lang.Long)))),contents={blockPoolId=BP-806886028-67.195.81.149-1464403912625,
createdRollbackImages=true, finalizeTime=0, startTime=1464403914656})>
	at org.junit.Assert.fail(Assert.java:88)
	at org.junit.Assert.failNotNull(Assert.java:664)
	at org.junit.Assert.assertNull(Assert.java:646)
	at org.junit.Assert.assertNull(Assert.java:656)
	at org.apache.hadoop.hdfs.TestRollingUpgrade.checkMxBeanIsNull(TestRollingUpgrade.java:295)
	at org.apache.hadoop.hdfs.TestRollingUpgrade.testRollback(TestRollingUpgrade.java:324)

Running org.apache.hadoop.hdfs.TestCrcCorruption
Tests run: 24, Failures: 0, Errors: 0, Skipped: 0, Time elapsed: 73.612 sec - in org.apache.hadoop.hdfs.TestDistributedFileSystem
Running org.apache.hadoop.hdfs.TestFsShellPermission
Tests run: 1, Failures: 0, Errors: 0, Skipped: 0, Time elapsed: 6.47 sec - in org.apache.hadoop.hdfs.TestFsShellPermission
Running org.apache.hadoop.hdfs.protocol.TestLocatedBlock
Tests run: 1, Failures: 0, Errors: 0, Skipped: 0, Time elapsed: 0.26 sec - in org.apache.hadoop.hdfs.protocol.TestLocatedBlock
Running org.apache.hadoop.hdfs.protocol.TestLayoutVersion
Tests run: 11, Failures: 0, Errors: 0, Skipped: 0, Time elapsed: 0.235 sec - in org.apache.hadoop.hdfs.protocol.TestLayoutVersion
Running org.apache.hadoop.hdfs.protocol.datatransfer.sasl.TestSaslDataTransfer
Tests run: 4, Failures: 0, Errors: 0, Skipped: 0, Time elapsed: 21.292 sec - in org.apache.hadoop.hdfs.TestCrcCorruption
Running org.apache.hadoop.hdfs.protocol.datatransfer.TestPacketReceiver
Tests run: 1, Failures: 0, Errors: 0, Skipped: 0, Time elapsed: 0.383 sec - in org.apache.hadoop.hdfs.protocol.datatransfer.TestPacketReceiver
Running org.apache.hadoop.hdfs.protocol.TestAnnotations
Tests run: 1, Failures: 0, Errors: 0, Skipped: 0, Time elapsed: 0.136 sec - in org.apache.hadoop.hdfs.protocol.TestAnnotations
Running org.apache.hadoop.hdfs.protocol.TestBlockListAsLongs
Tests run: 7, Failures: 0, Errors: 0, Skipped: 0, Time elapsed: 0.97 sec - in org.apache.hadoop.hdfs.protocol.TestBlockListAsLongs
Running org.apache.hadoop.hdfs.TestDFSStripedOutputStreamWithFailure170
Tests run: 10, Failures: 0, Errors: 0, Skipped: 0, Time elapsed: 0.386 sec - in org.apache.hadoop.hdfs.TestDFSStripedOutputStreamWithFailure170
Running org.apache.hadoop.hdfs.TestDFSStripedOutputStreamWithFailure190
Tests run: 10, Failures: 0, Errors: 0, Skipped: 0, Time elapsed: 0.41 sec - in org.apache.hadoop.hdfs.TestDFSStripedOutputStreamWithFailure190
Running org.apache.hadoop.hdfs.TestDFSAddressConfig
Tests run: 4, Failures: 0, Errors: 0, Skipped: 0, Time elapsed: 63.362 sec - in org.apache.hadoop.hdfs.TestDatanodeDeath
Running org.apache.hadoop.hdfs.TestDFSConfigKeys
Tests run: 1, Failures: 0, Errors: 0, Skipped: 0, Time elapsed: 0.3 sec - in org.apache.hadoop.hdfs.TestDFSConfigKeys
Running org.apache.hadoop.hdfs.TestParallelUnixDomainRead
Tests run: 1, Failures: 0, Errors: 0, Skipped: 0, Time elapsed: 6.319 sec - in org.apache.hadoop.hdfs.TestDFSAddressConfig
Running org.apache.hadoop.hdfs.TestDFSStripedOutputStreamWithFailure140
Tests run: 10, Failures: 0, Errors: 0, Skipped: 0, Time elapsed: 0.39 sec - in org.apache.hadoop.hdfs.TestDFSStripedOutputStreamWithFailure140
Running org.apache.hadoop.hdfs.TestDFSStripedOutputStreamWithFailure100
Tests run: 9, Failures: 0, Errors: 0, Skipped: 0, Time elapsed: 21.548 sec - in org.apache.hadoop.hdfs.protocol.datatransfer.sasl.TestSaslDataTransfer
Running org.apache.hadoop.hdfs.TestReplication
Tests run: 19, Failures: 0, Errors: 0, Skipped: 1, Time elapsed: 207.928 sec - in org.apache.hadoop.hdfs.TestDecommission
Running org.apache.hadoop.hdfs.TestAsyncDFS
Tests run: 4, Failures: 0, Errors: 0, Skipped: 0, Time elapsed: 40.25 sec - in org.apache.hadoop.hdfs.TestParallelUnixDomainRead
Running org.apache.hadoop.hdfs.TestFileChecksum
Tests run: 3, Failures: 0, Errors: 0, Skipped: 0, Time elapsed: 32.162 sec - in org.apache.hadoop.hdfs.TestAsyncDFS
Running org.apache.hadoop.hdfs.TestRead
Tests run: 3, Failures: 0, Errors: 0, Skipped: 0, Time elapsed: 9.944 sec - in org.apache.hadoop.hdfs.TestRead
Running org.apache.hadoop.hdfs.TestPipelines
Tests run: 1, Failures: 0, Errors: 0, Skipped: 0, Time elapsed: 7.349 sec - in org.apache.hadoop.hdfs.TestPipelines
Running org.apache.hadoop.hdfs.TestDFSStripedOutputStreamWithFailure
Tests run: 9, Failures: 0, Errors: 0, Skipped: 0, Time elapsed: 63.622 sec - in org.apache.hadoop.hdfs.TestReplication
Running org.apache.hadoop.hdfs.TestDeprecatedKeys
Tests run: 1, Failures: 0, Errors: 0, Skipped: 0, Time elapsed: 0.465 sec - in org.apache.hadoop.hdfs.TestDeprecatedKeys
Running org.apache.hadoop.hdfs.TestAclsEndToEnd
Tests run: 8, Failures: 0, Errors: 0, Skipped: 0, Time elapsed: 57.6 sec - in org.apache.hadoop.hdfs.TestFileChecksum
Running org.apache.hadoop.hdfs.TestParallelShortCircuitReadNoChecksum
Tests run: 10, Failures: 0, Errors: 0, Skipped: 0, Time elapsed: 97.472 sec - in org.apache.hadoop.hdfs.TestDFSStripedOutputStreamWithFailure100
Running org.apache.hadoop.hdfs.TestParallelShortCircuitRead
Tests run: 4, Failures: 0, Errors: 0, Skipped: 0, Time elapsed: 15.108 sec - in org.apache.hadoop.hdfs.TestParallelShortCircuitReadNoChecksum
Running org.apache.hadoop.hdfs.TestHDFSTrash
Tests run: 4, Failures: 0, Errors: 0, Skipped: 0, Time elapsed: 16.567 sec - in org.apache.hadoop.hdfs.TestParallelShortCircuitRead
Running org.apache.hadoop.hdfs.TestFileAppend
Tests run: 2, Failures: 0, Errors: 0, Skipped: 0, Time elapsed: 7.553 sec - in org.apache.hadoop.hdfs.TestHDFSTrash
Running org.apache.hadoop.hdfs.TestDFSRemove
Tests run: 1, Failures: 0, Errors: 0, Skipped: 0, Time elapsed: 18.71 sec - in org.apache.hadoop.hdfs.TestDFSRemove
Running org.apache.hadoop.hdfs.TestErasureCodingPolicyWithSnapshot
Tests run: 4, Failures: 0, Errors: 0, Skipped: 0, Time elapsed: 26.256 sec - in org.apache.hadoop.hdfs.TestErasureCodingPolicyWithSnapshot
Running org.apache.hadoop.hdfs.TestDFSRollback
Tests run: 12, Failures: 0, Errors: 0, Skipped: 0, Time elapsed: 49.353 sec - in org.apache.hadoop.hdfs.TestFileAppend
Running org.apache.hadoop.hdfs.TestReadWhileWriting
Tests run: 9, Failures: 0, Errors: 0, Skipped: 0, Time elapsed: 102.332 sec - in org.apache.hadoop.hdfs.TestAclsEndToEnd
Running org.apache.hadoop.hdfs.TestConnCache
Tests run: 1, Failures: 0, Errors: 0, Skipped: 0, Time elapsed: 8.669 sec - in org.apache.hadoop.hdfs.TestReadWhileWriting
Running org.apache.hadoop.hdfs.TestPersistBlocks
Tests run: 1, Failures: 0, Errors: 0, Skipped: 0, Time elapsed: 5.377 sec - in org.apache.hadoop.hdfs.TestConnCache
Running org.apache.hadoop.hdfs.TestSetrepDecreasing
Tests run: 4, Failures: 0, Errors: 0, Skipped: 0, Time elapsed: 128.215 sec - in org.apache.hadoop.hdfs.TestDFSStripedOutputStreamWithFailure
Running org.apache.hadoop.hdfs.TestDatanodeLayoutUpgrade
Tests run: 1, Failures: 0, Errors: 0, Skipped: 0, Time elapsed: 22.041 sec - in org.apache.hadoop.hdfs.TestDFSRollback
Running org.apache.hadoop.hdfs.TestFileCorruption
Tests run: 2, Failures: 0, Errors: 0, Skipped: 0, Time elapsed: 8.197 sec - in org.apache.hadoop.hdfs.TestDatanodeLayoutUpgrade
Running org.apache.hadoop.hdfs.TestDFSStartupVersions
Tests run: 1, Failures: 0, Errors: 0, Skipped: 0, Time elapsed: 18.492 sec - in org.apache.hadoop.hdfs.TestSetrepDecreasing
Running org.apache.hadoop.hdfs.TestWriteConfigurationToDFS
Tests run: 4, Failures: 0, Errors: 0, Skipped: 0, Time elapsed: 12.676 sec - in org.apache.hadoop.hdfs.TestFileCorruption
Running org.apache.hadoop.hdfs.TestListFilesInDFS
Tests run: 1, Failures: 0, Errors: 0, Skipped: 0, Time elapsed: 6.896 sec - in org.apache.hadoop.hdfs.TestWriteConfigurationToDFS
Tests run: 5, Failures: 0, Errors: 0, Skipped: 0, Time elapsed: 30.412 sec - in org.apache.hadoop.hdfs.TestPersistBlocks
Tests run: 2, Failures: 0, Errors: 0, Skipped: 0, Time elapsed: 5.847 sec - in org.apache.hadoop.hdfs.TestListFilesInDFS
Tests run: 1, Failures: 0, Errors: 0, Skipped: 0, Time elapsed: 16.361 sec - in org.apache.hadoop.hdfs.TestDFSStartupVersions

Results :

Failed tests: 
  TestDataNodeErasureCodingMetrics.testEcTasks:108 Bad value for metric EcReconstructionTasks
expected:<1> but was:<0>
  TestRollingUpgrade.testCheckpointWithMultipleNN:568->testCheckpoint:604 Test resulted
in an unexpected exit
  TestRollingUpgrade.testDFSAdminRollingUpgradeCommands:102->checkMxBeanIsNull:295 expected
null, but was:<javax.management.openmbean.CompositeDataSupport(compositeType=javax.management.openmbean.CompositeType(name=org.apache.hadoop.hdfs.protocol.RollingUpgradeInfo$Bean,items=((itemName=blockPoolId,itemType=javax.management.openmbean.SimpleType(name=java.lang.String)),(itemName=createdRollbackImages,itemType=javax.management.openmbean.SimpleType(name=java.lang.Boolean)),(itemName=finalizeTime,itemType=javax.management.openmbean.SimpleType(name=java.lang.Long)),(itemName=startTime,itemType=javax.management.openmbean.SimpleType(name=java.lang.Long)))),contents={blockPoolId=BP-806886028-67.195.81.149-1464403912625,
createdRollbackImages=true, finalizeTime=0, startTime=1464403914656})>
  TestRollingUpgrade.testRollback:324->checkMxBeanIsNull:295 expected null, but was:<javax.management.openmbean.CompositeDataSupport(compositeType=javax.management.openmbean.CompositeType(name=org.apache.hadoop.hdfs.protocol.RollingUpgradeInfo$Bean,items=((itemName=blockPoolId,itemType=javax.management.openmbean.SimpleType(name=java.lang.String)),(itemName=createdRollbackImages,itemType=javax.management.openmbean.SimpleType(name=java.lang.Boolean)),(itemName=finalizeTime,itemType=javax.management.openmbean.SimpleType(name=java.lang.Long)),(itemName=startTime,itemType=javax.management.openmbean.SimpleType(name=java.lang.Long)))),contents={blockPoolId=BP-806886028-67.195.81.149-1464403912625,
createdRollbackImages=true, finalizeTime=0, startTime=1464403914656})>

Tests in error: 
  TestOpenFilesWithSnapshot.testWithCheckpoint:94 ยป IO Timed out waiting for Min...

Tests run: 4425, Failures: 4, Errors: 1, Skipped: 17

[INFO]                                                                         
[INFO] ------------------------------------------------------------------------
[INFO] Skipping Apache Hadoop HDFS Native Client
[INFO] This project has been banned from the build due to previous failures.
[INFO] ------------------------------------------------------------------------
[INFO]                                                                         
[INFO] ------------------------------------------------------------------------
[INFO] Skipping Apache Hadoop HttpFS
[INFO] This project has been banned from the build due to previous failures.
[INFO] ------------------------------------------------------------------------
[INFO]                                                                         
[INFO] ------------------------------------------------------------------------
[INFO] Skipping Apache Hadoop HDFS BookKeeper Journal
[INFO] This project has been banned from the build due to previous failures.
[INFO] ------------------------------------------------------------------------
[INFO]                                                                         
[INFO] ------------------------------------------------------------------------
[INFO] Skipping Apache Hadoop HDFS-NFS
[INFO] This project has been banned from the build due to previous failures.
[INFO] ------------------------------------------------------------------------
[INFO]                                                                         
[INFO] ------------------------------------------------------------------------
[INFO] Building Apache Hadoop HDFS Project 3.0.0-alpha1-SNAPSHOT
[INFO] ------------------------------------------------------------------------
[INFO] 
[INFO] --- maven-clean-plugin:2.5:clean (default-clean) @ hadoop-hdfs-project ---
[INFO] Deleting <https://builds.apache.org/job/Hadoop-Hdfs-trunk-Java8/ws/source/hadoop-hdfs-project/target>
[INFO] 
[INFO] --- maven-antrun-plugin:1.7:run (create-testdirs) @ hadoop-hdfs-project ---
[INFO] Executing tasks

main:
    [mkdir] Created dir: <https://builds.apache.org/job/Hadoop-Hdfs-trunk-Java8/ws/source/hadoop-hdfs-project/target/test-dir>
[INFO] Executed tasks
[INFO] 
[INFO] --- maven-source-plugin:2.3:jar-no-fork (hadoop-java-sources) @ hadoop-hdfs-project
---
[INFO] 
[INFO] --- maven-source-plugin:2.3:test-jar-no-fork (hadoop-java-sources) @ hadoop-hdfs-project
---
[INFO] 
[INFO] --- maven-enforcer-plugin:1.3.1:enforce (dist-enforce) @ hadoop-hdfs-project ---
[INFO] 
[INFO] --- maven-site-plugin:3.5:attach-descriptor (attach-descriptor) @ hadoop-hdfs-project
---
[INFO] 
[INFO] --- maven-javadoc-plugin:2.8.1:jar (module-javadocs) @ hadoop-hdfs-project ---
[INFO] Not executing Javadoc as the project is not a Java classpath-capable package
[INFO] 
[INFO] --- maven-enforcer-plugin:1.3.1:enforce (depcheck) @ hadoop-hdfs-project ---
[INFO] 
[INFO] --- maven-checkstyle-plugin:2.15:checkstyle (default-cli) @ hadoop-hdfs-project ---
[INFO] 
[INFO] --- findbugs-maven-plugin:3.0.0:findbugs (default-cli) @ hadoop-hdfs-project ---
[INFO] ------------------------------------------------------------------------
[INFO] Reactor Summary:
[INFO] 
[INFO] Apache Hadoop HDFS Client .......................... SUCCESS [04:16 min]
[INFO] Apache Hadoop HDFS ................................. FAILURE [  01:06 h]
[INFO] Apache Hadoop HDFS Native Client ................... SKIPPED
[INFO] Apache Hadoop HttpFS ............................... SKIPPED
[INFO] Apache Hadoop HDFS BookKeeper Journal .............. SKIPPED
[INFO] Apache Hadoop HDFS-NFS ............................. SKIPPED
[INFO] Apache Hadoop HDFS Project ......................... SUCCESS [  0.092 s]
[INFO] ------------------------------------------------------------------------
[INFO] BUILD FAILURE
[INFO] ------------------------------------------------------------------------
[INFO] Total time: 01:11 h
[INFO] Finished at: 2016-05-28T02:56:31+00:00
[INFO] Final Memory: 95M/3847M
[INFO] ------------------------------------------------------------------------
[ERROR] Failed to execute goal org.apache.maven.plugins:maven-surefire-plugin:2.17:test (default-test)
on project hadoop-hdfs: There are test failures.
[ERROR] 
[ERROR] Please refer to <https://builds.apache.org/job/Hadoop-Hdfs-trunk-Java8/ws/source/hadoop-hdfs-project/hadoop-hdfs/target/surefire-reports>
for the individual test results.
[ERROR] -> [Help 1]
[ERROR] 
[ERROR] To see the full stack trace of the errors, re-run Maven with the -e switch.
[ERROR] Re-run Maven using the -X switch to enable full debug logging.
[ERROR] 
[ERROR] For more information about the errors and possible solutions, please read the following
articles:
[ERROR] [Help 1] http://cwiki.apache.org/confluence/display/MAVEN/MojoFailureException
[ERROR] 
[ERROR] After correcting the problems, you can resume the build with the command
[ERROR]   mvn <goals> -rf :hadoop-hdfs
Build step 'Execute shell' marked build as failure
Archiving artifacts
Setting LATEST1_8_HOME=/home/jenkins/jenkins-slave/tools/hudson.model.JDK/latest1.8
Setting MAVEN_3_3_3_HOME=/home/jenkins/jenkins-slave/tools/hudson.tasks.Maven_MavenInstallation/maven-3.3.3
Recording test results
Setting LATEST1_8_HOME=/home/jenkins/jenkins-slave/tools/hudson.model.JDK/latest1.8
Setting MAVEN_3_3_3_HOME=/home/jenkins/jenkins-slave/tools/hudson.tasks.Maven_MavenInstallation/maven-3.3.3
Setting LATEST1_8_HOME=/home/jenkins/jenkins-slave/tools/hudson.model.JDK/latest1.8
Setting MAVEN_3_3_3_HOME=/home/jenkins/jenkins-slave/tools/hudson.tasks.Maven_MavenInstallation/maven-3.3.3

---------------------------------------------------------------------
To unsubscribe, e-mail: hdfs-dev-unsubscribe@hadoop.apache.org
For additional commands, e-mail: hdfs-dev-help@hadoop.apache.org


Mime
View raw message