hadoop-hdfs-dev mailing list archives

Site index · List index
Message view « Date » · « Thread »
Top « Date » · « Thread »
From Apache Jenkins Server <jenk...@builds.apache.org>
Subject Build failed in Jenkins: Hadoop-Hdfs-trunk-Java8 #1269
Date Thu, 26 May 2016 00:25:43 GMT
See <https://builds.apache.org/job/Hadoop-Hdfs-trunk-Java8/1269/changes>

Changes:

[aw] HADOOP-12925. Checks for SPARC architecture need to include 64-bit SPARC

------------------------------------------
[...truncated 6707 lines...]
	at org.apache.hadoop.hdfs.protocolPB.ClientNamenodeProtocolTranslatorPB.getFileInfo(ClientNamenodeProtocolTranslatorPB.java:801)
	at sun.reflect.GeneratedMethodAccessor7.invoke(Unknown Source)
	at sun.reflect.DelegatingMethodAccessorImpl.invoke(DelegatingMethodAccessorImpl.java:43)
	at java.lang.reflect.Method.invoke(Method.java:498)
	at org.apache.hadoop.io.retry.RetryInvocationHandler.invokeMethod(RetryInvocationHandler.java:268)
	at org.apache.hadoop.io.retry.RetryInvocationHandler.invoke(RetryInvocationHandler.java:193)
	at org.apache.hadoop.io.retry.RetryInvocationHandler.invoke(RetryInvocationHandler.java:175)
	at com.sun.proxy.$Proxy23.getFileInfo(Unknown Source)
	at org.apache.hadoop.hdfs.DFSClient.getFileInfo(DFSClient.java:1630)
	at org.apache.hadoop.hdfs.DistributedFileSystem$27.doCall(DistributedFileSystem.java:1367)
	at org.apache.hadoop.hdfs.DistributedFileSystem$27.doCall(DistributedFileSystem.java:1364)
	at org.apache.hadoop.fs.FileSystemLinkResolver.resolve(FileSystemLinkResolver.java:81)
	at org.apache.hadoop.hdfs.DistributedFileSystem.getFileStatus(DistributedFileSystem.java:1379)
	at org.apache.hadoop.fs.FileSystem.exists(FileSystem.java:1440)
	at org.apache.hadoop.hdfs.TestAsyncDFSRename.internalTestConcurrentAsyncAPI(TestAsyncDFSRename.java:399)
	at org.apache.hadoop.hdfs.TestAsyncDFSRename.testAggressiveConcurrentAsyncAPI(TestAsyncDFSRename.java:289)

testConservativeConcurrentAsyncAPI(org.apache.hadoop.hdfs.TestAsyncDFSRename)  Time elapsed:
0.707 sec  <<< ERROR!
java.io.IOException: Cannot remove data directory: <https://builds.apache.org/job/Hadoop-Hdfs-trunk-Java8/ws/source/hadoop-hdfs-project/hadoop-hdfs/target/test/data/2/dfs/datapath>
'<https://builds.apache.org/job/Hadoop-Hdfs-trunk-Java8/ws/source/hadoop-hdfs-project/hadoop-hdfs/target/test/data/2/dfs/data'>:

	absolute:<https://builds.apache.org/job/Hadoop-Hdfs-trunk-Java8/ws/source/hadoop-hdfs-project/hadoop-hdfs/target/test/data/2/dfs/data>
	permissions: drwx
path '<https://builds.apache.org/job/Hadoop-Hdfs-trunk-Java8/ws/source/hadoop-hdfs-project/hadoop-hdfs/target/test/data/2/dfs'>:

	absolute:<https://builds.apache.org/job/Hadoop-Hdfs-trunk-Java8/ws/source/hadoop-hdfs-project/hadoop-hdfs/target/test/data/2/dfs>
	permissions: drwx
path '<https://builds.apache.org/job/Hadoop-Hdfs-trunk-Java8/ws/source/hadoop-hdfs-project/hadoop-hdfs/target/test/data/2'>:

	absolute:<https://builds.apache.org/job/Hadoop-Hdfs-trunk-Java8/ws/source/hadoop-hdfs-project/hadoop-hdfs/target/test/data/2>
	permissions: drwx
path '<https://builds.apache.org/job/Hadoop-Hdfs-trunk-Java8/ws/source/hadoop-hdfs-project/hadoop-hdfs/target/test/data'>:

	absolute:<https://builds.apache.org/job/Hadoop-Hdfs-trunk-Java8/ws/source/hadoop-hdfs-project/hadoop-hdfs/target/test/data>
	permissions: drwx
path '<https://builds.apache.org/job/Hadoop-Hdfs-trunk-Java8/ws/source/hadoop-hdfs-project/hadoop-hdfs/target/test'>:

	absolute:<https://builds.apache.org/job/Hadoop-Hdfs-trunk-Java8/ws/source/hadoop-hdfs-project/hadoop-hdfs/target/test>
	permissions: drwx
path '<https://builds.apache.org/job/Hadoop-Hdfs-trunk-Java8/ws/source/hadoop-hdfs-project/hadoop-hdfs/target'>:

	absolute:<https://builds.apache.org/job/Hadoop-Hdfs-trunk-Java8/ws/source/hadoop-hdfs-project/hadoop-hdfs/target>
	permissions: drwx
path '<https://builds.apache.org/job/Hadoop-Hdfs-trunk-Java8/ws/source/hadoop-hdfs-project/hadoop-hdfs'>:

	absolute:<https://builds.apache.org/job/Hadoop-Hdfs-trunk-Java8/ws/source/hadoop-hdfs-project/hadoop-hdfs>
	permissions: drwx
path '<https://builds.apache.org/job/Hadoop-Hdfs-trunk-Java8/ws/source/hadoop-hdfs-project'>:

	absolute:<https://builds.apache.org/job/Hadoop-Hdfs-trunk-Java8/ws/source/hadoop-hdfs-project>
	permissions: drwx
path '<https://builds.apache.org/job/Hadoop-Hdfs-trunk-Java8/ws/source'>: 
	absolute:<https://builds.apache.org/job/Hadoop-Hdfs-trunk-Java8/ws/source>
	permissions: drwx
path '<https://builds.apache.org/job/Hadoop-Hdfs-trunk-Java8/ws/'>: 
	absolute:<https://builds.apache.org/job/Hadoop-Hdfs-trunk-Java8/ws/>
	permissions: drwx
path '/home/jenkins/jenkins-slave/workspace': 
	absolute:/home/jenkins/jenkins-slave/workspace
	permissions: drwx
path '/home/jenkins/jenkins-slave': 
	absolute:/home/jenkins/jenkins-slave
	permissions: drwx
path '/home/jenkins': 
	absolute:/home/jenkins
	permissions: drwx
path '/home': 
	absolute:/home
	permissions: dr-x
path '/': 
	absolute:/
	permissions: dr-x

	at org.apache.hadoop.hdfs.MiniDFSCluster.initMiniDFSCluster(MiniDFSCluster.java:848)
	at org.apache.hadoop.hdfs.MiniDFSCluster.<init>(MiniDFSCluster.java:490)
	at org.apache.hadoop.hdfs.MiniDFSCluster$Builder.build(MiniDFSCluster.java:449)
	at org.apache.hadoop.hdfs.TestAsyncDFSRename.internalTestConcurrentAsyncAPI(TestAsyncDFSRename.java:313)
	at org.apache.hadoop.hdfs.TestAsyncDFSRename.testConservativeConcurrentAsyncAPI(TestAsyncDFSRename.java:284)

        at java.util.concurrent.ThreadPoolExecutor.runWorker(ThreadPoolExecutor.java
Running org.apache.hadoop.hdfs.tools.TestDFSHAAdmin
Tests run: 20, Failures: 0, Errors: 0, Skipped: 0, Time elapsed: 2.442 sec - in org.apache.hadoop.hdfs.tools.TestDFSHAAdmin
Running org.apache.hadoop.hdfs.tools.TestDelegationTokenFetcher
Tests run: 3, Failures: 0, Errors: 0, Skipped: 0, Time elapsed: 6.512 sec - in org.apache.hadoop.hdfs.tools.offlineImageViewer.TestOfflineImageViewerForAcl
Tests run: 6, Failures: 0, Errors: 0, Skipped: 0, Time elapsed: 7.65 sec - in org.apache.hadoop.hdfs.tools.offlineImageViewer.TestOfflineImageViewerForContentSummary
Running org.apache.hadoop.hdfs.tools.TestDebugAdmin
Running org.apache.hadoop.hdfs.tools.TestGetGroups
Tests run: 4, Failures: 0, Errors: 0, Skipped: 0, Time elapsed: 5.125 sec - in org.apache.hadoop.hdfs.tools.TestDelegationTokenFetcher
Running org.apache.hadoop.hdfs.tools.TestDFSAdminWithHA
Tests run: 6, Failures: 0, Errors: 0, Skipped: 0, Time elapsed: 6.223 sec - in org.apache.hadoop.hdfs.tools.TestGetGroups
Running org.apache.hadoop.hdfs.tools.offlineEditsViewer.TestOfflineEditsViewer
Tests run: 3, Failures: 0, Errors: 0, Skipped: 0, Time elapsed: 7.531 sec - in org.apache.hadoop.hdfs.tools.TestDebugAdmin
Running org.apache.hadoop.hdfs.TestHDFSFileSystemContract
Tests run: 12, Failures: 0, Errors: 0, Skipped: 0, Time elapsed: 103.883 sec - in org.apache.hadoop.hdfs.TestRollingUpgrade
Running org.apache.hadoop.hdfs.TestClose
Tests run: 1, Failures: 0, Errors: 0, Skipped: 0, Time elapsed: 5.808 sec - in org.apache.hadoop.hdfs.TestClose
Running org.apache.hadoop.hdfs.TestFetchImage
Tests run: 1, Failures: 0, Errors: 0, Skipped: 0, Time elapsed: 5.315 sec - in org.apache.hadoop.hdfs.TestFetchImage
Running org.apache.hadoop.hdfs.TestInjectionForSimulatedStorage
Tests run: 11, Failures: 0, Errors: 0, Skipped: 0, Time elapsed: 24.214 sec - in org.apache.hadoop.hdfs.tools.TestDFSAdminWithHA
Running org.apache.hadoop.hdfs.TestBlocksScheduledCounter
Tests run: 5, Failures: 0, Errors: 0, Skipped: 0, Time elapsed: 23.8 sec - in org.apache.hadoop.hdfs.tools.offlineEditsViewer.TestOfflineEditsViewer
Running org.apache.hadoop.hdfs.protocolPB.TestPBHelper
Tests run: 30, Failures: 0, Errors: 0, Skipped: 0, Time elapsed: 1.143 sec - in org.apache.hadoop.hdfs.protocolPB.TestPBHelper
Running org.apache.hadoop.hdfs.TestFileAppend
Tests run: 2, Failures: 0, Errors: 0, Skipped: 0, Time elapsed: 8.246 sec - in org.apache.hadoop.hdfs.TestBlocksScheduledCounter
Running org.apache.hadoop.hdfs.TestRollingUpgradeRollback
Tests run: 1, Failures: 0, Errors: 0, Skipped: 0, Time elapsed: 17.685 sec - in org.apache.hadoop.hdfs.TestInjectionForSimulatedStorage
Running org.apache.hadoop.hdfs.TestLease
Tests run: 3, Failures: 0, Errors: 0, Skipped: 0, Time elapsed: 12.901 sec - in org.apache.hadoop.hdfs.TestRollingUpgradeRollback
Running org.apache.hadoop.net.TestNetworkTopology
Tests run: 5, Failures: 0, Errors: 0, Skipped: 0, Time elapsed: 11.867 sec - in org.apache.hadoop.hdfs.TestLease
Running org.apache.hadoop.TestGenericRefresh
Tests run: 12, Failures: 0, Errors: 0, Skipped: 0, Time elapsed: 10.821 sec - in org.apache.hadoop.net.TestNetworkTopology
Tests run: 9, Failures: 0, Errors: 0, Skipped: 0, Time elapsed: 5.469 sec - in org.apache.hadoop.TestGenericRefresh
Running org.apache.hadoop.tracing.TestTracingShortCircuitLocalRead
Running org.apache.hadoop.tracing.TestTraceAdmin
Tests run: 1, Failures: 0, Errors: 0, Skipped: 0, Time elapsed: 6.422 sec - in org.apache.hadoop.tracing.TestTracingShortCircuitLocalRead
Tests run: 1, Failures: 0, Errors: 0, Skipped: 0, Time elapsed: 6.324 sec - in org.apache.hadoop.tracing.TestTraceAdmin
Running org.apache.hadoop.tracing.TestTracing
Running org.apache.hadoop.metrics2.sink.TestRollingFileSystemSinkWithHdfs
Tests run: 12, Failures: 0, Errors: 0, Skipped: 0, Time elapsed: 40.172 sec - in org.apache.hadoop.hdfs.TestFileAppend
Running org.apache.hadoop.metrics2.sink.TestRollingFileSystemSinkWithSecureHdfs
Tests run: 1, Failures: 0, Errors: 0, Skipped: 0, Time elapsed: 8.65 sec - in org.apache.hadoop.tracing.TestTracing
Running org.apache.hadoop.cli.TestDeleteCLI
Tests run: 2, Failures: 0, Errors: 0, Skipped: 0, Time elapsed: 15.841 sec - in org.apache.hadoop.metrics2.sink.TestRollingFileSystemSinkWithSecureHdfs
Tests run: 1, Failures: 0, Errors: 0, Skipped: 0, Time elapsed: 9.856 sec - in org.apache.hadoop.cli.TestDeleteCLI
Running org.apache.hadoop.cli.TestAclCLI
Running org.apache.hadoop.cli.TestHDFSCLI
Tests run: 1, Failures: 0, Errors: 0, Skipped: 0, Time elapsed: 7.383 sec - in org.apache.hadoop.cli.TestAclCLI
Running org.apache.hadoop.cli.TestErasureCodingCLI
Tests run: 1, Failures: 0, Errors: 0, Skipped: 0, Time elapsed: 8.84 sec - in org.apache.hadoop.cli.TestErasureCodingCLI
Running org.apache.hadoop.cli.TestCacheAdminCLI
Tests run: 1, Failures: 0, Errors: 0, Skipped: 0, Time elapsed: 8.507 sec - in org.apache.hadoop.cli.TestCacheAdminCLI
Running org.apache.hadoop.cli.TestXAttrCLI
Tests run: 1, Failures: 0, Errors: 0, Skipped: 0, Time elapsed: 7.655 sec - in org.apache.hadoop.cli.TestXAttrCLI
Running org.apache.hadoop.cli.TestCryptoAdminCLI
Tests run: 1, Failures: 0, Errors: 0, Skipped: 0, Time elapsed: 7.795 sec - in org.apache.hadoop.cli.TestCryptoAdminCLI
Running org.apache.hadoop.security.TestPermission
Tests run: 11, Failures: 0, Errors: 0, Skipped: 0, Time elapsed: 64.027 sec - in org.apache.hadoop.metrics2.sink.TestRollingFileSystemSinkWithHdfs
Running org.apache.hadoop.security.TestRefreshUserMappings
Tests run: 3, Failures: 0, Errors: 0, Skipped: 0, Time elapsed: 7.562 sec - in org.apache.hadoop.security.TestPermission
Tests run: 2, Failures: 0, Errors: 0, Skipped: 0, Time elapsed: 6.855 sec - in org.apache.hadoop.security.TestRefreshUserMappings
Running org.apache.hadoop.security.TestPermissionSymlinks
Running org.apache.hadoop.tools.TestTools
Tests run: 5, Failures: 0, Errors: 0, Skipped: 0, Time elapsed: 1.642 sec - in org.apache.hadoop.tools.TestTools
Running org.apache.hadoop.tools.TestHdfsConfigFields
Tests run: 3, Failures: 0, Errors: 0, Skipped: 0, Time elapsed: 0.718 sec - in org.apache.hadoop.tools.TestHdfsConfigFields
Running org.apache.hadoop.tools.TestJMXGet
Tests run: 15, Failures: 0, Errors: 0, Skipped: 0, Time elapsed: 6.813 sec - in org.apache.hadoop.security.TestPermissionSymlinks
Tests run: 44, Failures: 0, Errors: 0, Skipped: 0, Time elapsed: 144.029 sec - in org.apache.hadoop.hdfs.TestHDFSFileSystemContract
Tests run: 2, Failures: 0, Errors: 0, Skipped: 0, Time elapsed: 7.274 sec - in org.apache.hadoop.tools.TestJMXGet
Tests run: 1, Failures: 0, Errors: 0, Skipped: 0, Time elapsed: 85.014 sec - in org.apache.hadoop.cli.TestHDFSCLI

Results :

Failed tests: 
  TestDataNodeErasureCodingMetrics.testEcTasks:108 Bad value for metric EcReconstructionTasks
expected:<1> but was:<0>
  TestDataNodeLifeline.testNoLifelineSentIfHeartbeatsOnTime:256 Expect metrics to count no
lifeline calls. expected:<0> but was:<1>
  TestDataNodeHotSwapVolumes.testRemoveVolumeBeingWritten:609->testRemoveVolumeBeingWrittenForDatanode:694
expected:<0> but was:<1140889459>
  TestReconstructStripedBlocksWithRackAwareness.testReconstructForNotEnoughRacks:153 expected:<0>
but was:<1>

Tests in error: 
  TestAsyncDFSRename.testAggressiveConcurrentAsyncAPI:289->internalTestConcurrentAsyncAPI:399->Object.wait:-2
» 
  TestAsyncDFSRename.testConservativeConcurrentAsyncAPI:284->internalTestConcurrentAsyncAPI:313
» IO

Tests run: 4429, Failures: 4, Errors: 2, Skipped: 17

[INFO]                                                                         
[INFO] ------------------------------------------------------------------------
[INFO] Skipping Apache Hadoop HDFS Native Client
[INFO] This project has been banned from the build due to previous failures.
[INFO] ------------------------------------------------------------------------
[INFO]                                                                         
[INFO] ------------------------------------------------------------------------
[INFO] Skipping Apache Hadoop HttpFS
[INFO] This project has been banned from the build due to previous failures.
[INFO] ------------------------------------------------------------------------
[INFO]                                                                         
[INFO] ------------------------------------------------------------------------
[INFO] Skipping Apache Hadoop HDFS BookKeeper Journal
[INFO] This project has been banned from the build due to previous failures.
[INFO] ------------------------------------------------------------------------
[INFO]                                                                         
[INFO] ------------------------------------------------------------------------
[INFO] Skipping Apache Hadoop HDFS-NFS
[INFO] This project has been banned from the build due to previous failures.
[INFO] ------------------------------------------------------------------------
[INFO]                                                                         
[INFO] ------------------------------------------------------------------------
[INFO] Building Apache Hadoop HDFS Project 3.0.0-alpha1-SNAPSHOT
[INFO] ------------------------------------------------------------------------
[INFO] 
[INFO] --- maven-clean-plugin:2.5:clean (default-clean) @ hadoop-hdfs-project ---
[INFO] Deleting <https://builds.apache.org/job/Hadoop-Hdfs-trunk-Java8/ws/source/hadoop-hdfs-project/target>
[INFO] 
[INFO] --- maven-antrun-plugin:1.7:run (create-testdirs) @ hadoop-hdfs-project ---
[INFO] Executing tasks

main:
    [mkdir] Created dir: <https://builds.apache.org/job/Hadoop-Hdfs-trunk-Java8/ws/source/hadoop-hdfs-project/target/test-dir>
[INFO] Executed tasks
[INFO] 
[INFO] --- maven-source-plugin:2.3:jar-no-fork (hadoop-java-sources) @ hadoop-hdfs-project
---
[INFO] 
[INFO] --- maven-source-plugin:2.3:test-jar-no-fork (hadoop-java-sources) @ hadoop-hdfs-project
---
[INFO] 
[INFO] --- maven-enforcer-plugin:1.3.1:enforce (dist-enforce) @ hadoop-hdfs-project ---
[INFO] 
[INFO] --- maven-site-plugin:3.5:attach-descriptor (attach-descriptor) @ hadoop-hdfs-project
---
[INFO] 
[INFO] --- maven-javadoc-plugin:2.8.1:jar (module-javadocs) @ hadoop-hdfs-project ---
[INFO] Not executing Javadoc as the project is not a Java classpath-capable package
[INFO] 
[INFO] --- maven-enforcer-plugin:1.3.1:enforce (depcheck) @ hadoop-hdfs-project ---
[INFO] 
[INFO] --- maven-checkstyle-plugin:2.15:checkstyle (default-cli) @ hadoop-hdfs-project ---
[INFO] 
[INFO] --- findbugs-maven-plugin:3.0.0:findbugs (default-cli) @ hadoop-hdfs-project ---
[INFO] ------------------------------------------------------------------------
[INFO] Reactor Summary:
[INFO] 
[INFO] Apache Hadoop HDFS Client .......................... SUCCESS [04:10 min]
[INFO] Apache Hadoop HDFS ................................. FAILURE [59:25 min]
[INFO] Apache Hadoop HDFS Native Client ................... SKIPPED
[INFO] Apache Hadoop HttpFS ............................... SKIPPED
[INFO] Apache Hadoop HDFS BookKeeper Journal .............. SKIPPED
[INFO] Apache Hadoop HDFS-NFS ............................. SKIPPED
[INFO] Apache Hadoop HDFS Project ......................... SUCCESS [  0.144 s]
[INFO] ------------------------------------------------------------------------
[INFO] BUILD FAILURE
[INFO] ------------------------------------------------------------------------
[INFO] Total time: 01:03 h
[INFO] Finished at: 2016-05-26T00:25:25+00:00
[INFO] Final Memory: 98M/4305M
[INFO] ------------------------------------------------------------------------
[ERROR] Failed to execute goal org.apache.maven.plugins:maven-surefire-plugin:2.17:test (default-test)
on project hadoop-hdfs: There are test failures.
[ERROR] 
[ERROR] Please refer to <https://builds.apache.org/job/Hadoop-Hdfs-trunk-Java8/ws/source/hadoop-hdfs-project/hadoop-hdfs/target/surefire-reports>
for the individual test results.
[ERROR] -> [Help 1]
[ERROR] 
[ERROR] To see the full stack trace of the errors, re-run Maven with the -e switch.
[ERROR] Re-run Maven using the -X switch to enable full debug logging.
[ERROR] 
[ERROR] For more information about the errors and possible solutions, please read the following
articles:
[ERROR] [Help 1] http://cwiki.apache.org/confluence/display/MAVEN/MojoFailureException
[ERROR] 
[ERROR] After correcting the problems, you can resume the build with the command
[ERROR]   mvn <goals> -rf :hadoop-hdfs
Build step 'Execute shell' marked build as failure
Archiving artifacts
Setting LATEST1_8_HOME=/home/jenkins/jenkins-slave/tools/hudson.model.JDK/latest1.8
Setting MAVEN_3_3_3_HOME=/home/jenkins/jenkins-slave/tools/hudson.tasks.Maven_MavenInstallation/maven-3.3.3
Recording test results
Setting LATEST1_8_HOME=/home/jenkins/jenkins-slave/tools/hudson.model.JDK/latest1.8
Setting MAVEN_3_3_3_HOME=/home/jenkins/jenkins-slave/tools/hudson.tasks.Maven_MavenInstallation/maven-3.3.3
Setting LATEST1_8_HOME=/home/jenkins/jenkins-slave/tools/hudson.model.JDK/latest1.8
Setting MAVEN_3_3_3_HOME=/home/jenkins/jenkins-slave/tools/hudson.tasks.Maven_MavenInstallation/maven-3.3.3

---------------------------------------------------------------------
To unsubscribe, e-mail: hdfs-dev-unsubscribe@hadoop.apache.org
For additional commands, e-mail: hdfs-dev-help@hadoop.apache.org


Mime
View raw message