hadoop-hdfs-dev mailing list archives

Site index · List index
Message view « Date » · « Thread »
Top « Date » · « Thread »
From Apache Jenkins Server <jenk...@builds.apache.org>
Subject Hadoop-Hdfs-trunk-Java8 - Build # 1189 - Still Failing
Date Wed, 11 May 2016 00:32:10 GMT
See https://builds.apache.org/job/Hadoop-Hdfs-trunk-Java8/1189/

###################################################################################
########################## LAST 60 LINES OF THE CONSOLE ###########################
[...truncated 6678 lines...]
[INFO] --- maven-antrun-plugin:1.7:run (create-testdirs) @ hadoop-hdfs-project ---
[INFO] Executing tasks

main:
    [mkdir] Created dir: /home/jenkins/jenkins-slave/workspace/Hadoop-Hdfs-trunk-Java8/hadoop-hdfs-project/target/test-dir
[INFO] Executed tasks
[INFO] 
[INFO] --- maven-source-plugin:2.3:jar-no-fork (hadoop-java-sources) @ hadoop-hdfs-project
---
[INFO] 
[INFO] --- maven-source-plugin:2.3:test-jar-no-fork (hadoop-java-sources) @ hadoop-hdfs-project
---
[INFO] 
[INFO] --- maven-enforcer-plugin:1.3.1:enforce (dist-enforce) @ hadoop-hdfs-project ---
[INFO] 
[INFO] --- maven-site-plugin:3.5:attach-descriptor (attach-descriptor) @ hadoop-hdfs-project
---
[INFO] 
[INFO] --- maven-javadoc-plugin:2.8.1:jar (module-javadocs) @ hadoop-hdfs-project ---
[INFO] Not executing Javadoc as the project is not a Java classpath-capable package
[INFO] 
[INFO] --- maven-enforcer-plugin:1.3.1:enforce (depcheck) @ hadoop-hdfs-project ---
[INFO] 
[INFO] --- maven-checkstyle-plugin:2.15:checkstyle (default-cli) @ hadoop-hdfs-project ---
[INFO] 
[INFO] --- findbugs-maven-plugin:3.0.0:findbugs (default-cli) @ hadoop-hdfs-project ---
[INFO] ------------------------------------------------------------------------
[INFO] Reactor Summary:
[INFO] 
[INFO] Apache Hadoop HDFS Client ......................... SUCCESS [04:19 min]
[INFO] Apache Hadoop HDFS ................................ FAILURE [  01:06 h]
[INFO] Apache Hadoop HDFS Native Client .................. SKIPPED
[INFO] Apache Hadoop HttpFS .............................. SKIPPED
[INFO] Apache Hadoop HDFS BookKeeper Journal ............. SKIPPED
[INFO] Apache Hadoop HDFS-NFS ............................ SKIPPED
[INFO] Apache Hadoop HDFS Project ........................ SUCCESS [  0.077 s]
[INFO] ------------------------------------------------------------------------
[INFO] BUILD FAILURE
[INFO] ------------------------------------------------------------------------
[INFO] Total time: 01:10 h
[INFO] Finished at: 2016-05-11T00:32:02+00:00
[INFO] Final Memory: 59M/1078M
[INFO] ------------------------------------------------------------------------
[ERROR] Failed to execute goal org.apache.maven.plugins:maven-surefire-plugin:2.17:test (default-test)
on project hadoop-hdfs: There are test failures.
[ERROR] 
[ERROR] Please refer to /home/jenkins/jenkins-slave/workspace/Hadoop-Hdfs-trunk-Java8/hadoop-hdfs-project/hadoop-hdfs/target/surefire-reports
for the individual test results.
[ERROR] -> [Help 1]
[ERROR] 
[ERROR] To see the full stack trace of the errors, re-run Maven with the -e switch.
[ERROR] Re-run Maven using the -X switch to enable full debug logging.
[ERROR] 
[ERROR] For more information about the errors and possible solutions, please read the following
articles:
[ERROR] [Help 1] http://cwiki.apache.org/confluence/display/MAVEN/MojoFailureException
[ERROR] 
[ERROR] After correcting the problems, you can resume the build with the command
[ERROR]   mvn <goals> -rf :hadoop-hdfs
Build step 'Execute shell' marked build as failure
Archiving artifacts
Recording test results
Sending e-mails to: hdfs-dev@hadoop.apache.org
Email was triggered for: Failure - Any
Sending email for trigger: Failure - Any



###################################################################################
############################## FAILED TESTS (if any) ##############################
3 tests failed.
FAILED:  org.apache.hadoop.hdfs.TestAsyncDFSRename.testConservativeConcurrentAsyncRenameWithOverwrite

Error Message:
test timed out after 60000 milliseconds

Stack Trace:
java.lang.Exception: test timed out after 60000 milliseconds
	at java.lang.Thread.sleep(Native Method)
	at org.apache.hadoop.hdfs.MiniDFSCluster.waitActive(MiniDFSCluster.java:2472)
	at org.apache.hadoop.hdfs.MiniDFSCluster.waitActive(MiniDFSCluster.java:2512)
	at org.apache.hadoop.hdfs.MiniDFSCluster.restartNameNodes(MiniDFSCluster.java:1977)
	at org.apache.hadoop.hdfs.TestAsyncDFSRename.internalTestConcurrentAsyncRenameWithOverwrite(TestAsyncDFSRename.java:248)
	at org.apache.hadoop.hdfs.TestAsyncDFSRename.testConservativeConcurrentAsyncRenameWithOverwrite(TestAsyncDFSRename.java:191)


FAILED:  org.apache.hadoop.hdfs.TestFileAppend.testMultipleAppends

Error Message:
Failed to replace a bad datanode on the existing pipeline due to no more good datanodes being
available to try. (Nodes: current=[DatanodeInfoWithStorage[127.0.0.1:51602,DS-ac70b8bb-a1d9-4b9e-a445-49352d50bd10,DISK],
DatanodeInfoWithStorage[127.0.0.1:45524,DS-2cb4df53-09c6-4a4c-a338-6c670ba08ead,DISK]], original=[DatanodeInfoWithStorage[127.0.0.1:51602,DS-ac70b8bb-a1d9-4b9e-a445-49352d50bd10,DISK],
DatanodeInfoWithStorage[127.0.0.1:45524,DS-2cb4df53-09c6-4a4c-a338-6c670ba08ead,DISK]]). The
current failed datanode replacement policy is DEFAULT, and a client may configure this via
'dfs.client.block.write.replace-datanode-on-failure.policy' in its configuration.

Stack Trace:
java.io.IOException: Failed to replace a bad datanode on the existing pipeline due to no more
good datanodes being available to try. (Nodes: current=[DatanodeInfoWithStorage[127.0.0.1:51602,DS-ac70b8bb-a1d9-4b9e-a445-49352d50bd10,DISK],
DatanodeInfoWithStorage[127.0.0.1:45524,DS-2cb4df53-09c6-4a4c-a338-6c670ba08ead,DISK]], original=[DatanodeInfoWithStorage[127.0.0.1:51602,DS-ac70b8bb-a1d9-4b9e-a445-49352d50bd10,DISK],
DatanodeInfoWithStorage[127.0.0.1:45524,DS-2cb4df53-09c6-4a4c-a338-6c670ba08ead,DISK]]). The
current failed datanode replacement policy is DEFAULT, and a client may configure this via
'dfs.client.block.write.replace-datanode-on-failure.policy' in its configuration.
	at org.apache.hadoop.hdfs.DataStreamer.findNewDatanode(DataStreamer.java:1170)
	at org.apache.hadoop.hdfs.DataStreamer.addDatanode2ExistingPipeline(DataStreamer.java:1236)
	at org.apache.hadoop.hdfs.DataStreamer.handleDatanodeReplacement(DataStreamer.java:1427)
	at org.apache.hadoop.hdfs.DataStreamer.setupPipelineInternal(DataStreamer.java:1342)
	at org.apache.hadoop.hdfs.DataStreamer.setupPipelineForAppendOrRecovery(DataStreamer.java:1325)
	at org.apache.hadoop.hdfs.DataStreamer.run(DataStreamer.java:603)


FAILED:  org.apache.hadoop.hdfs.server.datanode.TestDataNodeMXBean.testDataNodeMXBeanBlockCount

Error Message:
After delete one file expected:<4> but was:<5>

Stack Trace:
java.lang.AssertionError: After delete one file expected:<4> but was:<5>
	at org.junit.Assert.fail(Assert.java:88)
	at org.junit.Assert.failNotEquals(Assert.java:743)
	at org.junit.Assert.assertEquals(Assert.java:118)
	at org.junit.Assert.assertEquals(Assert.java:555)
	at org.apache.hadoop.hdfs.server.datanode.TestDataNodeMXBean.testDataNodeMXBeanBlockCount(TestDataNodeMXBean.java:120)




Mime
View raw message