hadoop-hdfs-dev mailing list archives

Site index · List index
Message view « Date » · « Thread »
Top « Date » · « Thread »
From Apache Jenkins Server <jenk...@builds.apache.org>
Subject Build failed in Jenkins: Hadoop-Hdfs-trunk-Java8 #1204
Date Fri, 13 May 2016 08:56:46 GMT
See <https://builds.apache.org/job/Hadoop-Hdfs-trunk-Java8/1204/changes>

Changes:

[wang] HADOOP-11180. Change log message "token.Token: Cannot find class for

[wang] HADOOP-12868. Fix hadoop-openstack undeclared and unused dependencies.

------------------------------------------
[...truncated 6621 lines...]
Tests run: 26, Failures: 0, Errors: 0, Skipped: 0, Time elapsed: 118.399 sec - in org.apache.hadoop.hdfs.TestEncryptedTransfer
Java HotSpot(TM) 64-Bit Server VM warning: ignoring option MaxPermSize=768m; support was removed
in 8.0
Running org.apache.hadoop.hdfs.TestClientProtocolForPipelineRecovery
Tests run: 14, Failures: 0, Errors: 0, Skipped: 0, Time elapsed: 33.438 sec - in org.apache.hadoop.hdfs.TestHFlush
Java HotSpot(TM) 64-Bit Server VM warning: ignoring option MaxPermSize=768m; support was removed
in 8.0
Running org.apache.hadoop.hdfs.TestWriteReadStripedFile
Tests run: 4, Failures: 0, Errors: 0, Skipped: 0, Time elapsed: 53.308 sec - in org.apache.hadoop.hdfs.TestParallelUnixDomainRead
Java HotSpot(TM) 64-Bit Server VM warning: ignoring option MaxPermSize=768m; support was removed
in 8.0
Running org.apache.hadoop.hdfs.TestDFSClientExcludedNodes
Tests run: 8, Failures: 0, Errors: 0, Skipped: 0, Time elapsed: 58.298 sec - in org.apache.hadoop.hdfs.TestClientProtocolForPipelineRecovery
Java HotSpot(TM) 64-Bit Server VM warning: ignoring option MaxPermSize=768m; support was removed
in 8.0
Running org.apache.hadoop.hdfs.TestDatanodeReport
Tests run: 2, Failures: 0, Errors: 0, Skipped: 0, Time elapsed: 14.281 sec - in org.apache.hadoop.hdfs.TestDFSClientExcludedNodes
Java HotSpot(TM) 64-Bit Server VM warning: ignoring option MaxPermSize=768m; support was removed
in 8.0
Running org.apache.hadoop.hdfs.TestMiniDFSCluster
Tests run: 7, Failures: 0, Errors: 0, Skipped: 0, Time elapsed: 15.526 sec - in org.apache.hadoop.hdfs.TestMiniDFSCluster
Java HotSpot(TM) 64-Bit Server VM warning: ignoring option MaxPermSize=768m; support was removed
in 8.0
Running org.apache.hadoop.hdfs.TestBlocksScheduledCounter
Tests run: 2, Failures: 0, Errors: 0, Skipped: 0, Time elapsed: 24.386 sec - in org.apache.hadoop.hdfs.TestDatanodeReport
Java HotSpot(TM) 64-Bit Server VM warning: ignoring option MaxPermSize=768m; support was removed
in 8.0
Running org.apache.hadoop.hdfs.TestDFSClientSocketSize
Tests run: 2, Failures: 0, Errors: 0, Skipped: 0, Time elapsed: 7.627 sec - in org.apache.hadoop.hdfs.TestBlocksScheduledCounter
Java HotSpot(TM) 64-Bit Server VM warning: ignoring option MaxPermSize=768m; support was removed
in 8.0
Running org.apache.hadoop.hdfs.TestDFSStorageStateRecovery
Tests run: 44, Failures: 0, Errors: 0, Skipped: 0, Time elapsed: 124.954 sec - in org.apache.hadoop.hdfs.TestHDFSFileSystemContract
Java HotSpot(TM) 64-Bit Server VM warning: ignoring option MaxPermSize=768m; support was removed
in 8.0
Running org.apache.hadoop.hdfs.TestSnapshotCommands
Tests run: 3, Failures: 0, Errors: 0, Skipped: 0, Time elapsed: 8.251 sec - in org.apache.hadoop.hdfs.TestDFSClientSocketSize
Java HotSpot(TM) 64-Bit Server VM warning: ignoring option MaxPermSize=768m; support was removed
in 8.0
Running org.apache.hadoop.hdfs.TestParallelShortCircuitRead
Tests run: 6, Failures: 0, Errors: 0, Skipped: 0, Time elapsed: 6.418 sec - in org.apache.hadoop.hdfs.TestSnapshotCommands
Java HotSpot(TM) 64-Bit Server VM warning: ignoring option MaxPermSize=768m; support was removed
in 8.0
Running org.apache.hadoop.hdfs.TestDFSPermission
Tests run: 4, Failures: 0, Errors: 0, Skipped: 0, Time elapsed: 20.418 sec - in org.apache.hadoop.hdfs.TestParallelShortCircuitRead
Java HotSpot(TM) 64-Bit Server VM warning: ignoring option MaxPermSize=768m; support was removed
in 8.0
Running org.apache.hadoop.hdfs.TestDFSStripedOutputStreamWithFailure170
Tests run: 8, Failures: 0, Errors: 0, Skipped: 0, Time elapsed: 27.713 sec - in org.apache.hadoop.hdfs.TestDFSPermission
Java HotSpot(TM) 64-Bit Server VM warning: ignoring option MaxPermSize=768m; support was removed
in 8.0
Running org.apache.hadoop.hdfs.TestParallelRead
Tests run: 17, Failures: 0, Errors: 0, Skipped: 0, Time elapsed: 155.709 sec - in org.apache.hadoop.hdfs.TestWriteReadStripedFile
Java HotSpot(TM) 64-Bit Server VM warning: ignoring option MaxPermSize=768m; support was removed
in 8.0
Running org.apache.hadoop.hdfs.TestDFSStripedOutputStream
Tests run: 10, Failures: 0, Errors: 0, Skipped: 0, Time elapsed: 53.847 sec - in org.apache.hadoop.hdfs.TestDFSStripedOutputStreamWithFailure170
Java HotSpot(TM) 64-Bit Server VM warning: ignoring option MaxPermSize=768m; support was removed
in 8.0
Running org.apache.hadoop.hdfs.TestAclsEndToEnd
Tests run: 3, Failures: 0, Errors: 0, Skipped: 0, Time elapsed: 82.876 sec - in org.apache.hadoop.hdfs.TestDFSStorageStateRecovery
Java HotSpot(TM) 64-Bit Server VM warning: ignoring option MaxPermSize=768m; support was removed
in 8.0
Running org.apache.hadoop.hdfs.TestRollingUpgradeRollback
Tests run: 3, Failures: 0, Errors: 0, Skipped: 0, Time elapsed: 16.21 sec - in org.apache.hadoop.hdfs.TestRollingUpgradeRollback
Java HotSpot(TM) 64-Bit Server VM warning: ignoring option MaxPermSize=768m; support was removed
in 8.0
Tests run: 4, Failures: 0, Errors: 0, Skipped: 0, Time elapsed: 60.813 sec - in org.apache.hadoop.hdfs.TestParallelRead
Running org.apache.hadoop.hdfs.TestDFSConfigKeys
Tests run: 1, Failures: 0, Errors: 0, Skipped: 0, Time elapsed: 0.217 sec - in org.apache.hadoop.hdfs.TestDFSConfigKeys
Java HotSpot(TM) 64-Bit Server VM warning: ignoring option MaxPermSize=768m; support was removed
in 8.0
Java HotSpot(TM) 64-Bit Server VM warning: ignoring option MaxPermSize=768m; support was removed
in 8.0
Running org.apache.hadoop.hdfs.TestRollingUpgradeDowngrade
Running org.apache.hadoop.hdfs.TestDFSUtil
Tests run: 31, Failures: 0, Errors: 0, Skipped: 0, Time elapsed: 4.251 sec - in org.apache.hadoop.hdfs.TestDFSUtil
Java HotSpot(TM) 64-Bit Server VM warning: ignoring option MaxPermSize=768m; support was removed
in 8.0
Running org.apache.hadoop.hdfs.TestDatanodeStartupFixesLegacyStorageIDs
Tests run: 2, Failures: 0, Errors: 0, Skipped: 0, Time elapsed: 11.334 sec - in org.apache.hadoop.hdfs.TestRollingUpgradeDowngrade
Java HotSpot(TM) 64-Bit Server VM warning: ignoring option MaxPermSize=768m; support was removed
in 8.0
Running org.apache.hadoop.hdfs.TestExternalBlockReader
Tests run: 3, Failures: 0, Errors: 0, Skipped: 0, Time elapsed: 8.342 sec - in org.apache.hadoop.hdfs.TestDatanodeStartupFixesLegacyStorageIDs
Java HotSpot(TM) 64-Bit Server VM warning: ignoring option MaxPermSize=768m; support was removed
in 8.0
Running org.apache.hadoop.hdfs.TestDeprecatedKeys
Tests run: 1, Failures: 0, Errors: 0, Skipped: 0, Time elapsed: 0.731 sec - in org.apache.hadoop.hdfs.TestDeprecatedKeys
Java HotSpot(TM) 64-Bit Server VM warning: ignoring option MaxPermSize=768m; support was removed
in 8.0
Running org.apache.hadoop.hdfs.TestGetBlocks
Tests run: 2, Failures: 0, Errors: 0, Skipped: 0, Time elapsed: 8.93 sec - in org.apache.hadoop.hdfs.TestExternalBlockReader
Java HotSpot(TM) 64-Bit Server VM warning: ignoring option MaxPermSize=768m; support was removed
in 8.0
Running org.apache.hadoop.hdfs.TestRead
Tests run: 3, Failures: 0, Errors: 0, Skipped: 0, Time elapsed: 8.939 sec - in org.apache.hadoop.hdfs.TestRead
Java HotSpot(TM) 64-Bit Server VM warning: ignoring option MaxPermSize=768m; support was removed
in 8.0
Running org.apache.hadoop.hdfs.TestParallelReadUtil
Tests run: 1, Failures: 0, Errors: 0, Skipped: 1, Time elapsed: 0.038 sec - in org.apache.hadoop.hdfs.TestParallelReadUtil
Java HotSpot(TM) 64-Bit Server VM warning: ignoring option MaxPermSize=768m; support was removed
in 8.0
Running org.apache.hadoop.hdfs.shortcircuit.TestShortCircuitCache
Tests run: 14, Failures: 0, Errors: 0, Skipped: 0, Time elapsed: 62.024 sec - in org.apache.hadoop.hdfs.TestDFSStripedOutputStream
Java HotSpot(TM) 64-Bit Server VM warning: ignoring option MaxPermSize=768m; support was removed
in 8.0
Running org.apache.hadoop.hdfs.shortcircuit.TestShortCircuitLocalRead
Tests run: 11, Failures: 1, Errors: 0, Skipped: 0, Time elapsed: 13.884 sec <<< FAILURE!
- in org.apache.hadoop.hdfs.shortcircuit.TestShortCircuitCache
testDataXceiverCleansUpSlotsOnFailure(org.apache.hadoop.hdfs.shortcircuit.TestShortCircuitCache)
 Time elapsed: 0.498 sec  <<< FAILURE!
java.lang.AssertionError: expected:<1> but was:<2>
	at org.junit.Assert.fail(Assert.java:88)
	at org.junit.Assert.failNotEquals(Assert.java:743)
	at org.junit.Assert.assertEquals(Assert.java:118)
	at org.junit.Assert.assertEquals(Assert.java:555)
	at org.junit.Assert.assertEquals(Assert.java:542)
	at org.apache.hadoop.hdfs.shortcircuit.TestShortCircuitCache$17.accept(TestShortCircuitCache.java:633)
	at org.apache.hadoop.hdfs.server.datanode.ShortCircuitRegistry.visit(ShortCircuitRegistry.java:403)
	at org.apache.hadoop.hdfs.shortcircuit.TestShortCircuitCache.checkNumberOfSegmentsAndSlots(TestShortCircuitCache.java:628)
	at org.apache.hadoop.hdfs.shortcircuit.TestShortCircuitCache.testDataXceiverCleansUpSlotsOnFailure(TestShortCircuitCache.java:682)

Java HotSpot(TM) 64-Bit Server VM warning: ignoring option MaxPermSize=768m; support was removed
in 8.0
Running org.apache.hadoop.hdfs.TestMultiThreadedHflush
Tests run: 9, Failures: 0, Errors: 0, Skipped: 0, Time elapsed: 77.453 sec - in org.apache.hadoop.hdfs.TestAclsEndToEnd
Java HotSpot(TM) 64-Bit Server VM warning: ignoring option MaxPermSize=768m; support was removed
in 8.0
Running org.apache.hadoop.hdfs.TestReconstructStripedFile
Tests run: 3, Failures: 0, Errors: 0, Skipped: 0, Time elapsed: 12.562 sec - in org.apache.hadoop.hdfs.TestMultiThreadedHflush
Java HotSpot(TM) 64-Bit Server VM warning: ignoring option MaxPermSize=768m; support was removed
in 8.0
Running org.apache.hadoop.hdfs.TestSafeModeWithStripedFile
Tests run: 3, Failures: 0, Errors: 0, Skipped: 0, Time elapsed: 46.985 sec - in org.apache.hadoop.hdfs.TestGetBlocks
Java HotSpot(TM) 64-Bit Server VM warning: ignoring option MaxPermSize=768m; support was removed
in 8.0
Running org.apache.hadoop.hdfs.TestEncryptionZonesWithKMS
Tests run: 11, Failures: 0, Errors: 0, Skipped: 0, Time elapsed: 24.807 sec - in org.apache.hadoop.hdfs.shortcircuit.TestShortCircuitLocalRead
Java HotSpot(TM) 64-Bit Server VM warning: ignoring option MaxPermSize=768m; support was removed
in 8.0
Running org.apache.hadoop.hdfs.TestFileLengthOnClusterRestart
Tests run: 1, Failures: 0, Errors: 0, Skipped: 0, Time elapsed: 13.064 sec - in org.apache.hadoop.hdfs.TestFileLengthOnClusterRestart
Java HotSpot(TM) 64-Bit Server VM warning: ignoring option MaxPermSize=768m; support was removed
in 8.0
Running org.apache.hadoop.hdfs.TestBlockMissingException
Tests run: 1, Failures: 0, Errors: 0, Skipped: 0, Time elapsed: 7.874 sec - in org.apache.hadoop.hdfs.TestBlockMissingException
Java HotSpot(TM) 64-Bit Server VM warning: ignoring option MaxPermSize=768m; support was removed
in 8.0
Running org.apache.hadoop.hdfs.TestReplication
Tests run: 2, Failures: 0, Errors: 0, Skipped: 0, Time elapsed: 35.372 sec - in org.apache.hadoop.hdfs.TestSafeModeWithStripedFile
Java HotSpot(TM) 64-Bit Server VM warning: ignoring option MaxPermSize=768m; support was removed
in 8.0
Running org.apache.hadoop.hdfs.TestDFSStripedOutputStreamWithFailure090
Tests run: 10, Failures: 0, Errors: 0, Skipped: 0, Time elapsed: 48.566 sec - in org.apache.hadoop.hdfs.TestDFSStripedOutputStreamWithFailure090
Java HotSpot(TM) 64-Bit Server VM warning: ignoring option MaxPermSize=768m; support was removed
in 8.0
Running org.apache.hadoop.hdfs.TestFileAppend
Tests run: 9, Failures: 0, Errors: 0, Skipped: 0, Time elapsed: 58.073 sec - in org.apache.hadoop.hdfs.TestReplication
Java HotSpot(TM) 64-Bit Server VM warning: ignoring option MaxPermSize=768m; support was removed
in 8.0
Running org.apache.hadoop.hdfs.TestDistributedFileSystem
Tests run: 13, Failures: 0, Errors: 0, Skipped: 0, Time elapsed: 91.118 sec - in org.apache.hadoop.hdfs.TestReconstructStripedFile
Java HotSpot(TM) 64-Bit Server VM warning: ignoring option MaxPermSize=768m; support was removed
in 8.0
Running org.apache.hadoop.hdfs.TestDFSStripedOutputStreamWithFailure160
Tests run: 28, Failures: 0, Errors: 0, Skipped: 0, Time elapsed: 92.58 sec - in org.apache.hadoop.hdfs.TestEncryptionZonesWithKMS
Java HotSpot(TM) 64-Bit Server VM warning: ignoring option MaxPermSize=768m; support was removed
in 8.0
Running org.apache.hadoop.hdfs.TestReservedRawPaths
Tests run: 8, Failures: 0, Errors: 0, Skipped: 0, Time elapsed: 14.363 sec - in org.apache.hadoop.hdfs.TestReservedRawPaths
Java HotSpot(TM) 64-Bit Server VM warning: ignoring option MaxPermSize=768m; support was removed
in 8.0
Running org.apache.hadoop.hdfs.TestMissingBlocksAlert
Tests run: 1, Failures: 0, Errors: 0, Skipped: 0, Time elapsed: 7.59 sec - in org.apache.hadoop.hdfs.TestMissingBlocksAlert
Java HotSpot(TM) 64-Bit Server VM warning: ignoring option MaxPermSize=768m; support was removed
in 8.0
Running org.apache.hadoop.hdfs.TestClose
Tests run: 12, Failures: 0, Errors: 0, Skipped: 0, Time elapsed: 40.219 sec - in org.apache.hadoop.hdfs.TestFileAppend
Java HotSpot(TM) 64-Bit Server VM warning: ignoring option MaxPermSize=768m; support was removed
in 8.0
Tests run: 1, Failures: 0, Errors: 0, Skipped: 0, Time elapsed: 6.377 sec - in org.apache.hadoop.hdfs.TestClose
Running org.apache.hadoop.hdfs.TestDFSStripedOutputStreamWithFailure120
Java HotSpot(TM) 64-Bit Server VM warning: ignoring option MaxPermSize=768m; support was removed
in 8.0
Running org.apache.hadoop.hdfs.TestFileConcurrentReader
Tests run: 22, Failures: 0, Errors: 0, Skipped: 0, Time elapsed: 62.371 sec - in org.apache.hadoop.hdfs.TestDistributedFileSystem
Java HotSpot(TM) 64-Bit Server VM warning: ignoring option MaxPermSize=768m; support was removed
in 8.0
Running org.apache.hadoop.hdfs.TestHDFSServerPorts
Tests run: 7, Failures: 0, Errors: 0, Skipped: 0, Time elapsed: 29.265 sec - in org.apache.hadoop.hdfs.TestFileConcurrentReader
Java HotSpot(TM) 64-Bit Server VM warning: ignoring option MaxPermSize=768m; support was removed
in 8.0
Running org.apache.hadoop.tracing.TestTracing
Tests run: 4, Failures: 0, Errors: 0, Skipped: 0, Time elapsed: 9.881 sec - in org.apache.hadoop.hdfs.TestHDFSServerPorts
Java HotSpot(TM) 64-Bit Server VM warning: ignoring option MaxPermSize=768m; support was removed
in 8.0
Running org.apache.hadoop.tracing.TestTraceAdmin
Tests run: 1, Failures: 0, Errors: 0, Skipped: 0, Time elapsed: 8.685 sec - in org.apache.hadoop.tracing.TestTracing
Java HotSpot(TM) 64-Bit Server VM warning: ignoring option MaxPermSize=768m; support was removed
in 8.0
Running org.apache.hadoop.tracing.TestTracingShortCircuitLocalRead
Tests run: 1, Failures: 0, Errors: 0, Skipped: 0, Time elapsed: 7.504 sec - in org.apache.hadoop.tracing.TestTraceAdmin
Tests run: 1, Failures: 0, Errors: 0, Skipped: 0, Time elapsed: 6.401 sec - in org.apache.hadoop.tracing.TestTracingShortCircuitLocalRead
Tests run: 10, Failures: 0, Errors: 0, Skipped: 0, Time elapsed: 52.52 sec - in org.apache.hadoop.hdfs.TestDFSStripedOutputStreamWithFailure120
Tests run: 10, Failures: 0, Errors: 0, Skipped: 0, Time elapsed: 96.335 sec - in org.apache.hadoop.hdfs.TestDFSStripedOutputStreamWithFailure160

Results :

Failed tests: 
  TestShortCircuitCache.testDataXceiverCleansUpSlotsOnFailure:682->checkNumberOfSegmentsAndSlots:628
expected:<1> but was:<2>

Tests in error: 
  TestDataNodeMultipleRegistrations.testClusterIdMismatchAtStartupWithHA:259 ยป  ...

Tests run: 4411, Failures: 1, Errors: 1, Skipped: 17

[INFO]                                                                         
[INFO] ------------------------------------------------------------------------
[INFO] Skipping Apache Hadoop HDFS Native Client
[INFO] This project has been banned from the build due to previous failures.
[INFO] ------------------------------------------------------------------------
[INFO]                                                                         
[INFO] ------------------------------------------------------------------------
[INFO] Skipping Apache Hadoop HttpFS
[INFO] This project has been banned from the build due to previous failures.
[INFO] ------------------------------------------------------------------------
[INFO]                                                                         
[INFO] ------------------------------------------------------------------------
[INFO] Skipping Apache Hadoop HDFS BookKeeper Journal
[INFO] This project has been banned from the build due to previous failures.
[INFO] ------------------------------------------------------------------------
[INFO]                                                                         
[INFO] ------------------------------------------------------------------------
[INFO] Skipping Apache Hadoop HDFS-NFS
[INFO] This project has been banned from the build due to previous failures.
[INFO] ------------------------------------------------------------------------
[INFO]                                                                         
[INFO] ------------------------------------------------------------------------
[INFO] Building Apache Hadoop HDFS Project 3.0.0-alpha1-SNAPSHOT
[INFO] ------------------------------------------------------------------------
[INFO] 
[INFO] --- maven-clean-plugin:2.5:clean (default-clean) @ hadoop-hdfs-project ---
[INFO] Deleting <https://builds.apache.org/job/Hadoop-Hdfs-trunk-Java8/ws/hadoop-hdfs-project/target>
[INFO] 
[INFO] --- maven-antrun-plugin:1.7:run (create-testdirs) @ hadoop-hdfs-project ---
[INFO] Executing tasks

main:
    [mkdir] Created dir: <https://builds.apache.org/job/Hadoop-Hdfs-trunk-Java8/ws/hadoop-hdfs-project/target/test-dir>
[INFO] Executed tasks
[INFO] 
[INFO] --- maven-source-plugin:2.3:jar-no-fork (hadoop-java-sources) @ hadoop-hdfs-project
---
[INFO] 
[INFO] --- maven-source-plugin:2.3:test-jar-no-fork (hadoop-java-sources) @ hadoop-hdfs-project
---
[INFO] 
[INFO] --- maven-enforcer-plugin:1.3.1:enforce (dist-enforce) @ hadoop-hdfs-project ---
[INFO] 
[INFO] --- maven-site-plugin:3.5:attach-descriptor (attach-descriptor) @ hadoop-hdfs-project
---
[INFO] 
[INFO] --- maven-javadoc-plugin:2.8.1:jar (module-javadocs) @ hadoop-hdfs-project ---
[INFO] Not executing Javadoc as the project is not a Java classpath-capable package
[INFO] 
[INFO] --- maven-enforcer-plugin:1.3.1:enforce (depcheck) @ hadoop-hdfs-project ---
[INFO] 
[INFO] --- maven-checkstyle-plugin:2.15:checkstyle (default-cli) @ hadoop-hdfs-project ---
[INFO] 
[INFO] --- findbugs-maven-plugin:3.0.0:findbugs (default-cli) @ hadoop-hdfs-project ---
[INFO] ------------------------------------------------------------------------
[INFO] Reactor Summary:
[INFO] 
[INFO] Apache Hadoop HDFS Client ......................... SUCCESS [04:02 min]
[INFO] Apache Hadoop HDFS ................................ FAILURE [  01:06 h]
[INFO] Apache Hadoop HDFS Native Client .................. SKIPPED
[INFO] Apache Hadoop HttpFS .............................. SKIPPED
[INFO] Apache Hadoop HDFS BookKeeper Journal ............. SKIPPED
[INFO] Apache Hadoop HDFS-NFS ............................ SKIPPED
[INFO] Apache Hadoop HDFS Project ........................ SUCCESS [  0.099 s]
[INFO] ------------------------------------------------------------------------
[INFO] BUILD FAILURE
[INFO] ------------------------------------------------------------------------
[INFO] Total time: 01:10 h
[INFO] Finished at: 2016-05-13T08:56:26+00:00
[INFO] Final Memory: 73M/995M
[INFO] ------------------------------------------------------------------------
[ERROR] Failed to execute goal org.apache.maven.plugins:maven-surefire-plugin:2.17:test (default-test)
on project hadoop-hdfs: There was a timeout or other error in the fork -> [Help 1]
[ERROR] 
[ERROR] To see the full stack trace of the errors, re-run Maven with the -e switch.
[ERROR] Re-run Maven using the -X switch to enable full debug logging.
[ERROR] 
[ERROR] For more information about the errors and possible solutions, please read the following
articles:
[ERROR] [Help 1] http://cwiki.apache.org/confluence/display/MAVEN/MojoFailureException
[ERROR] 
[ERROR] After correcting the problems, you can resume the build with the command
[ERROR]   mvn <goals> -rf :hadoop-hdfs
Build step 'Execute shell' marked build as failure
Archiving artifacts
Recording test results

---------------------------------------------------------------------
To unsubscribe, e-mail: hdfs-dev-unsubscribe@hadoop.apache.org
For additional commands, e-mail: hdfs-dev-help@hadoop.apache.org


Mime
View raw message