hadoop-hdfs-dev mailing list archives

Site index · List index
Message view « Date » · « Thread »
Top « Date » · « Thread »
From Apache Jenkins Server <jenk...@builds.apache.org>
Subject Hadoop-Hdfs-trunk - Build # 3091 - Failure
Date Tue, 03 May 2016 05:32:24 GMT
See https://builds.apache.org/job/Hadoop-Hdfs-trunk/3091/

###################################################################################
########################## LAST 60 LINES OF THE CONSOLE ###########################
[...truncated 7275 lines...]
[INFO] --- maven-antrun-plugin:1.7:run (create-testdirs) @ hadoop-hdfs-project ---
[INFO] Executing tasks

main:
    [mkdir] Created dir: /home/jenkins/jenkins-slave/workspace/Hadoop-Hdfs-trunk/hadoop-hdfs-project/target/test-dir
[INFO] Executed tasks
[INFO] 
[INFO] --- maven-source-plugin:2.3:jar-no-fork (hadoop-java-sources) @ hadoop-hdfs-project
---
[INFO] 
[INFO] --- maven-source-plugin:2.3:test-jar-no-fork (hadoop-java-sources) @ hadoop-hdfs-project
---
[INFO] 
[INFO] --- maven-enforcer-plugin:1.3.1:enforce (dist-enforce) @ hadoop-hdfs-project ---
[INFO] 
[INFO] --- maven-site-plugin:3.5:attach-descriptor (attach-descriptor) @ hadoop-hdfs-project
---
[INFO] 
[INFO] --- maven-javadoc-plugin:2.8.1:jar (module-javadocs) @ hadoop-hdfs-project ---
[INFO] Skipping javadoc generation
[INFO] 
[INFO] --- maven-enforcer-plugin:1.3.1:enforce (depcheck) @ hadoop-hdfs-project ---
[INFO] 
[INFO] --- maven-checkstyle-plugin:2.15:checkstyle (default-cli) @ hadoop-hdfs-project ---
[INFO] 
[INFO] --- findbugs-maven-plugin:3.0.0:findbugs (default-cli) @ hadoop-hdfs-project ---
[INFO] ------------------------------------------------------------------------
[INFO] Reactor Summary:
[INFO] 
[INFO] Apache Hadoop HDFS Client ......................... SUCCESS [04:02 min]
[INFO] Apache Hadoop HDFS ................................ FAILURE [  01:16 h]
[INFO] Apache Hadoop HDFS Native Client .................. SKIPPED
[INFO] Apache Hadoop HttpFS .............................. SKIPPED
[INFO] Apache Hadoop HDFS BookKeeper Journal ............. SKIPPED
[INFO] Apache Hadoop HDFS-NFS ............................ SKIPPED
[INFO] Apache Hadoop HDFS Project ........................ SUCCESS [  0.129 s]
[INFO] ------------------------------------------------------------------------
[INFO] BUILD FAILURE
[INFO] ------------------------------------------------------------------------
[INFO] Total time: 01:20 h
[INFO] Finished at: 2016-05-03T05:32:07+00:00
[INFO] Final Memory: 60M/847M
[INFO] ------------------------------------------------------------------------
[ERROR] Failed to execute goal org.apache.maven.plugins:maven-surefire-plugin:2.17:test (default-test)
on project hadoop-hdfs: There are test failures.
[ERROR] 
[ERROR] Please refer to /home/jenkins/jenkins-slave/workspace/Hadoop-Hdfs-trunk/hadoop-hdfs-project/hadoop-hdfs/target/surefire-reports
for the individual test results.
[ERROR] -> [Help 1]
[ERROR] 
[ERROR] To see the full stack trace of the errors, re-run Maven with the -e switch.
[ERROR] Re-run Maven using the -X switch to enable full debug logging.
[ERROR] 
[ERROR] For more information about the errors and possible solutions, please read the following
articles:
[ERROR] [Help 1] http://cwiki.apache.org/confluence/display/MAVEN/MojoFailureException
[ERROR] 
[ERROR] After correcting the problems, you can resume the build with the command
[ERROR]   mvn <goals> -rf :hadoop-hdfs
Build step 'Execute shell' marked build as failure
Archiving artifacts
Recording test results
Sending e-mails to: hdfs-dev@hadoop.apache.org
Email was triggered for: Failure - Any
Sending email for trigger: Failure - Any



###################################################################################
############################## FAILED TESTS (if any) ##############################
3 tests failed.
FAILED:  org.apache.hadoop.hdfs.TestAsyncDFSRename.testAggressiveConcurrentAsyncRenameWithOverwrite

Error Message:
test timed out after 120000 milliseconds

Stack Trace:
java.lang.Exception: test timed out after 120000 milliseconds
	at java.lang.Object.wait(Native Method)
	at org.apache.hadoop.hdfs.DataStreamer.waitForAckedSeqno(DataStreamer.java:768)
	at org.apache.hadoop.hdfs.DFSOutputStream.flushInternal(DFSOutputStream.java:697)
	at org.apache.hadoop.hdfs.DFSOutputStream.closeImpl(DFSOutputStream.java:778)
	at org.apache.hadoop.hdfs.DFSOutputStream.close(DFSOutputStream.java:755)
	at org.apache.hadoop.fs.FSDataOutputStream$PositionCache.close(FSDataOutputStream.java:72)
	at org.apache.hadoop.fs.FSDataOutputStream.close(FSDataOutputStream.java:101)
	at org.apache.hadoop.hdfs.DFSTestUtil.createFile(DFSTestUtil.java:430)
	at org.apache.hadoop.hdfs.DFSTestUtil.createFile(DFSTestUtil.java:379)
	at org.apache.hadoop.hdfs.DFSTestUtil.createFile(DFSTestUtil.java:372)
	at org.apache.hadoop.hdfs.DFSTestUtil.createFile(DFSTestUtil.java:365)
	at org.apache.hadoop.hdfs.TestAsyncDFSRename.internalTestConcurrentAsyncRenameWithOverwrite(TestAsyncDFSRename.java:220)
	at org.apache.hadoop.hdfs.TestAsyncDFSRename.testAggressiveConcurrentAsyncRenameWithOverwrite(TestAsyncDFSRename.java:184)


FAILED:  org.apache.hadoop.hdfs.TestAsyncDFSRename.testConservativeConcurrentAsyncRenameWithOverwrite

Error Message:
test timed out after 60000 milliseconds

Stack Trace:
java.lang.Exception: test timed out after 60000 milliseconds
	at java.lang.Object.wait(Native Method)
	at org.apache.hadoop.hdfs.DataStreamer.waitForAckedSeqno(DataStreamer.java:768)
	at org.apache.hadoop.hdfs.DFSOutputStream.flushInternal(DFSOutputStream.java:697)
	at org.apache.hadoop.hdfs.DFSOutputStream.closeImpl(DFSOutputStream.java:778)
	at org.apache.hadoop.hdfs.DFSOutputStream.close(DFSOutputStream.java:755)
	at org.apache.hadoop.fs.FSDataOutputStream$PositionCache.close(FSDataOutputStream.java:72)
	at org.apache.hadoop.fs.FSDataOutputStream.close(FSDataOutputStream.java:101)
	at org.apache.hadoop.hdfs.DFSTestUtil.createFile(DFSTestUtil.java:430)
	at org.apache.hadoop.hdfs.DFSTestUtil.createFile(DFSTestUtil.java:379)
	at org.apache.hadoop.hdfs.DFSTestUtil.createFile(DFSTestUtil.java:372)
	at org.apache.hadoop.hdfs.DFSTestUtil.createFile(DFSTestUtil.java:365)
	at org.apache.hadoop.hdfs.TestAsyncDFSRename.internalTestConcurrentAsyncRenameWithOverwrite(TestAsyncDFSRename.java:220)
	at org.apache.hadoop.hdfs.TestAsyncDFSRename.testConservativeConcurrentAsyncRenameWithOverwrite(TestAsyncDFSRename.java:191)


FAILED:  org.apache.hadoop.hdfs.server.datanode.fsdataset.impl.TestFsDatasetImpl.testCleanShutdownOfVolume

Error Message:
Expected to find 'DatanodeInfoWithStorage[127.0.0.1:47156,DS-f263c3ce-7366-4fe9-82ed-f338971ad032,DISK]'
but got unexpected exception:java.io.IOException: All datanodes [DatanodeInfoWithStorage[127.0.0.1:47156,DS-3af399ea-7778-4b34-876a-6cbd5edcd8a8,DISK]]
are bad. Aborting...
 at org.apache.hadoop.hdfs.DataStreamer.handleBadDatanode(DataStreamer.java:1394)
 at org.apache.hadoop.hdfs.DataStreamer.setupPipelineInternal(DataStreamer.java:1338)
 at org.apache.hadoop.hdfs.DataStreamer.setupPipelineForAppendOrRecovery(DataStreamer.java:1325)
 at org.apache.hadoop.hdfs.DataStreamer.processDatanodeOrExternalError(DataStreamer.java:1122)
 at org.apache.hadoop.hdfs.DataStreamer.run(DataStreamer.java:549)


Stack Trace:
java.lang.AssertionError: Expected to find 'DatanodeInfoWithStorage[127.0.0.1:47156,DS-f263c3ce-7366-4fe9-82ed-f338971ad032,DISK]'
but got unexpected exception:java.io.IOException: All datanodes [DatanodeInfoWithStorage[127.0.0.1:47156,DS-3af399ea-7778-4b34-876a-6cbd5edcd8a8,DISK]]
are bad. Aborting...
	at org.apache.hadoop.hdfs.DataStreamer.handleBadDatanode(DataStreamer.java:1394)
	at org.apache.hadoop.hdfs.DataStreamer.setupPipelineInternal(DataStreamer.java:1338)
	at org.apache.hadoop.hdfs.DataStreamer.setupPipelineForAppendOrRecovery(DataStreamer.java:1325)
	at org.apache.hadoop.hdfs.DataStreamer.processDatanodeOrExternalError(DataStreamer.java:1122)
	at org.apache.hadoop.hdfs.DataStreamer.run(DataStreamer.java:549)

	at org.apache.hadoop.test.GenericTestUtils.assertExceptionContains(GenericTestUtils.java:248)
	at org.apache.hadoop.hdfs.server.datanode.fsdataset.impl.TestFsDatasetImpl.testCleanShutdownOfVolume(TestFsDatasetImpl.java:686)
Caused by: java.io.IOException: All datanodes [DatanodeInfoWithStorage[127.0.0.1:47156,DS-3af399ea-7778-4b34-876a-6cbd5edcd8a8,DISK]]
are bad. Aborting...
	at org.apache.hadoop.hdfs.DataStreamer.handleBadDatanode(DataStreamer.java:1394)
	at org.apache.hadoop.hdfs.DataStreamer.setupPipelineInternal(DataStreamer.java:1338)
	at org.apache.hadoop.hdfs.DataStreamer.setupPipelineForAppendOrRecovery(DataStreamer.java:1325)
	at org.apache.hadoop.hdfs.DataStreamer.processDatanodeOrExternalError(DataStreamer.java:1122)
	at org.apache.hadoop.hdfs.DataStreamer.run(DataStreamer.java:549)




Mime
View raw message