hadoop-hdfs-dev mailing list archives

Site index · List index
Message view « Date » · « Thread »
Top « Date » · « Thread »
From Apache Jenkins Server <jenk...@builds.apache.org>
Subject Build failed in Jenkins: Hadoop-Hdfs-trunk-Java8 #1284
Date Sat, 28 May 2016 16:58:31 GMT
See <https://builds.apache.org/job/Hadoop-Hdfs-trunk-Java8/1284/changes>

Changes:

[kasha] YARN-5132. Exclude generated protobuf sources from YARN Javadoc build.

------------------------------------------
[...truncated 5266 lines...]
Running org.apache.hadoop.hdfs.TestReconstructStripedFile
Tests run: 14, Failures: 0, Errors: 0, Skipped: 0, Time elapsed: 76.952 sec - in org.apache.hadoop.hdfs.TestDFSStripedOutputStream
Running org.apache.hadoop.hdfs.TestDFSInputStream
Tests run: 10, Failures: 0, Errors: 0, Skipped: 0, Time elapsed: 104.335 sec - in org.apache.hadoop.hdfs.TestDFSStripedOutputStreamWithFailure050
Running org.apache.hadoop.hdfs.TestDFSRemove
Tests run: 4, Failures: 0, Errors: 0, Skipped: 0, Time elapsed: 16.335 sec - in org.apache.hadoop.hdfs.TestDFSInputStream
Running org.apache.hadoop.hdfs.TestFileAppend4
Tests run: 1, Failures: 0, Errors: 0, Skipped: 0, Time elapsed: 20.837 sec - in org.apache.hadoop.hdfs.TestDFSRemove
Running org.apache.hadoop.hdfs.TestParallelRead
Tests run: 13, Failures: 0, Errors: 0, Skipped: 0, Time elapsed: 110.752 sec - in org.apache.hadoop.hdfs.TestReconstructStripedFile
Tests run: 17, Failures: 0, Errors: 0, Skipped: 0, Time elapsed: 153.161 sec - in org.apache.hadoop.hdfs.TestWriteReadStripedFile
Running org.apache.hadoop.hdfs.TestClose
Running org.apache.hadoop.hdfs.TestDFSStripedOutputStreamWithFailure040
Tests run: 1, Failures: 0, Errors: 0, Skipped: 0, Time elapsed: 6.318 sec - in org.apache.hadoop.hdfs.TestClose
Running org.apache.hadoop.hdfs.TestDFSAddressConfig
Tests run: 1, Failures: 0, Errors: 0, Skipped: 0, Time elapsed: 7.34 sec - in org.apache.hadoop.hdfs.TestDFSAddressConfig
Running org.apache.hadoop.hdfs.TestDFSStripedOutputStreamWithFailure170
Tests run: 10, Failures: 0, Errors: 0, Skipped: 0, Time elapsed: 0.435 sec - in org.apache.hadoop.hdfs.TestDFSStripedOutputStreamWithFailure170
Running org.apache.hadoop.hdfs.TestParallelShortCircuitLegacyRead
Tests run: 4, Failures: 0, Errors: 0, Skipped: 0, Time elapsed: 39.891 sec - in org.apache.hadoop.hdfs.TestFileAppend4
Running org.apache.hadoop.hdfs.TestLargeBlock
Tests run: 4, Failures: 0, Errors: 0, Skipped: 0, Time elapsed: 18.758 sec - in org.apache.hadoop.hdfs.TestParallelShortCircuitLegacyRead
Running org.apache.hadoop.hdfs.TestHDFSTrash
Tests run: 4, Failures: 0, Errors: 0, Skipped: 0, Time elapsed: 43.252 sec - in org.apache.hadoop.hdfs.TestParallelRead
Running org.apache.hadoop.hdfs.TestClientReportBadBlock
Tests run: 2, Failures: 0, Errors: 0, Skipped: 0, Time elapsed: 8.235 sec - in org.apache.hadoop.hdfs.TestHDFSTrash
Running org.apache.hadoop.hdfs.TestWriteRead
Tests run: 1, Failures: 0, Errors: 0, Skipped: 0, Time elapsed: 23.648 sec - in org.apache.hadoop.hdfs.TestLargeBlock
Running org.apache.hadoop.hdfs.TestClientProtocolForPipelineRecovery
Tests run: 3, Failures: 0, Errors: 0, Skipped: 0, Time elapsed: 13.44 sec - in org.apache.hadoop.hdfs.TestClientReportBadBlock
Tests run: 10, Failures: 0, Errors: 0, Skipped: 0, Time elapsed: 50.035 sec - in org.apache.hadoop.hdfs.TestDFSStripedOutputStreamWithFailure040
Running org.apache.hadoop.hdfs.TestBalancerBandwidth
Running org.apache.hadoop.hdfs.TestDFSUpgrade
Tests run: 1, Failures: 0, Errors: 0, Skipped: 0, Time elapsed: 16.037 sec - in org.apache.hadoop.hdfs.TestBalancerBandwidth
Running org.apache.hadoop.hdfs.TestBlockStoragePolicy
Tests run: 2, Failures: 0, Errors: 0, Skipped: 0, Time elapsed: 21.961 sec - in org.apache.hadoop.hdfs.TestDFSUpgrade
Running org.apache.hadoop.hdfs.TestFileLengthOnClusterRestart
Tests run: 3, Failures: 0, Errors: 0, Skipped: 0, Time elapsed: 30.431 sec - in org.apache.hadoop.hdfs.TestWriteRead
Running org.apache.hadoop.hdfs.TestLeaseRecoveryStriped
Tests run: 1, Failures: 0, Errors: 0, Skipped: 0, Time elapsed: 12.681 sec - in org.apache.hadoop.hdfs.TestFileLengthOnClusterRestart
Running org.apache.hadoop.hdfs.client.impl.TestBlockReaderLocal
Tests run: 8, Failures: 0, Errors: 0, Skipped: 0, Time elapsed: 63.317 sec - in org.apache.hadoop.hdfs.TestClientProtocolForPipelineRecovery
Running org.apache.hadoop.hdfs.client.impl.TestBlockReaderLocalLegacy
Tests run: 1, Failures: 0, Errors: 0, Skipped: 0, Time elapsed: 38.389 sec - in org.apache.hadoop.hdfs.TestLeaseRecoveryStriped
Running org.apache.hadoop.hdfs.client.impl.TestBlockReaderRemote2
Tests run: 20, Failures: 0, Errors: 0, Skipped: 0, Time elapsed: 50.549 sec - in org.apache.hadoop.hdfs.TestBlockStoragePolicy
Running org.apache.hadoop.hdfs.client.impl.TestClientBlockVerification
Tests run: 1, Failures: 0, Errors: 0, Skipped: 0, Time elapsed: 5.925 sec - in org.apache.hadoop.hdfs.client.impl.TestBlockReaderRemote2
Running org.apache.hadoop.hdfs.client.impl.TestBlockReaderRemote
Tests run: 3, Failures: 0, Errors: 0, Skipped: 0, Time elapsed: 8.856 sec - in org.apache.hadoop.hdfs.client.impl.TestBlockReaderLocalLegacy
Running org.apache.hadoop.hdfs.client.impl.TestBlockReaderFactory
Tests run: 4, Failures: 0, Errors: 0, Skipped: 0, Time elapsed: 6.651 sec - in org.apache.hadoop.hdfs.client.impl.TestClientBlockVerification
Running org.apache.hadoop.hdfs.qjournal.TestSecureNNWithQJM
Tests run: 1, Failures: 0, Errors: 0, Skipped: 0, Time elapsed: 6.261 sec - in org.apache.hadoop.hdfs.client.impl.TestBlockReaderRemote
Running org.apache.hadoop.hdfs.qjournal.TestNNWithQJM
Tests run: 3, Failures: 0, Errors: 0, Skipped: 0, Time elapsed: 11.22 sec - in org.apache.hadoop.hdfs.qjournal.TestNNWithQJM
Running org.apache.hadoop.hdfs.qjournal.server.TestJournalNodeMXBean
Tests run: 7, Failures: 0, Errors: 0, Skipped: 0, Time elapsed: 19.64 sec - in org.apache.hadoop.hdfs.client.impl.TestBlockReaderFactory
Running org.apache.hadoop.hdfs.qjournal.server.TestJournal
Tests run: 1, Failures: 0, Errors: 0, Skipped: 0, Time elapsed: 2.545 sec - in org.apache.hadoop.hdfs.qjournal.server.TestJournalNodeMXBean
Running org.apache.hadoop.hdfs.qjournal.server.TestJournalNode
Tests run: 12, Failures: 0, Errors: 0, Skipped: 0, Time elapsed: 4.925 sec - in org.apache.hadoop.hdfs.qjournal.server.TestJournal
Running org.apache.hadoop.hdfs.qjournal.client.TestIPCLoggerChannel
Tests run: 3, Failures: 0, Errors: 0, Skipped: 0, Time elapsed: 0.901 sec - in org.apache.hadoop.hdfs.qjournal.client.TestIPCLoggerChannel
Running org.apache.hadoop.hdfs.qjournal.client.TestQJMWithFaults
Tests run: 37, Failures: 0, Errors: 0, Skipped: 0, Time elapsed: 67.54 sec - in org.apache.hadoop.hdfs.client.impl.TestBlockReaderLocal
Running org.apache.hadoop.hdfs.qjournal.client.TestEpochsAreUnique
Tests run: 2, Failures: 0, Errors: 0, Skipped: 0, Time elapsed: 36.659 sec - in org.apache.hadoop.hdfs.qjournal.TestSecureNNWithQJM
Running org.apache.hadoop.hdfs.qjournal.client.TestQuorumJournalManagerUnit
Tests run: 1, Failures: 0, Errors: 0, Skipped: 0, Time elapsed: 9.438 sec - in org.apache.hadoop.hdfs.qjournal.client.TestEpochsAreUnique
Running org.apache.hadoop.hdfs.qjournal.client.TestSegmentRecoveryComparator
Tests run: 6, Failures: 0, Errors: 0, Skipped: 0, Time elapsed: 1.465 sec - in org.apache.hadoop.hdfs.qjournal.client.TestQuorumJournalManagerUnit
Tests run: 1, Failures: 0, Errors: 0, Skipped: 0, Time elapsed: 0.254 sec - in org.apache.hadoop.hdfs.qjournal.client.TestSegmentRecoveryComparator
Running org.apache.hadoop.hdfs.qjournal.client.TestQuorumCall
Running org.apache.hadoop.hdfs.qjournal.client.TestQuorumJournalManager
Tests run: 1, Failures: 0, Errors: 0, Skipped: 0, Time elapsed: 0.313 sec - in org.apache.hadoop.hdfs.qjournal.client.TestQuorumCall
Running org.apache.hadoop.hdfs.qjournal.TestMiniJournalCluster
Tests run: 6, Failures: 0, Errors: 0, Skipped: 0, Time elapsed: 24.438 sec - in org.apache.hadoop.hdfs.qjournal.server.TestJournalNode
Running org.apache.hadoop.hdfs.TestAsyncDFSRename
Tests run: 1, Failures: 0, Errors: 0, Skipped: 0, Time elapsed: 3.015 sec - in org.apache.hadoop.hdfs.qjournal.TestMiniJournalCluster
Running org.apache.hadoop.hdfs.TestFileCreationEmpty
Tests run: 1, Failures: 0, Errors: 0, Skipped: 0, Time elapsed: 10.671 sec - in org.apache.hadoop.hdfs.TestFileCreationEmpty
Running org.apache.hadoop.hdfs.TestDFSStripedOutputStreamWithFailure200
Tests run: 2, Failures: 0, Errors: 0, Skipped: 0, Time elapsed: 37.733 sec - in org.apache.hadoop.hdfs.TestAsyncDFSRename
Running org.apache.hadoop.hdfs.TestBlockMissingException
Tests run: 1, Failures: 0, Errors: 0, Skipped: 0, Time elapsed: 6.816 sec - in org.apache.hadoop.hdfs.TestBlockMissingException
Running org.apache.hadoop.hdfs.TestDataTransferKeepalive
Tests run: 21, Failures: 0, Errors: 0, Skipped: 0, Time elapsed: 56.279 sec - in org.apache.hadoop.hdfs.qjournal.client.TestQuorumJournalManager
Running org.apache.hadoop.hdfs.TestModTime
Tests run: 4, Failures: 0, Errors: 0, Skipped: 0, Time elapsed: 22.017 sec - in org.apache.hadoop.hdfs.TestDataTransferKeepalive
Running org.apache.hadoop.hdfs.TestDFSStripedOutputStreamWithFailure210
Tests run: 10, Failures: 0, Errors: 0, Skipped: 0, Time elapsed: 0.437 sec - in org.apache.hadoop.hdfs.TestDFSStripedOutputStreamWithFailure210
Running org.apache.hadoop.hdfs.TestRollingUpgradeDowngrade
Tests run: 2, Failures: 0, Errors: 0, Skipped: 0, Time elapsed: 16.126 sec - in org.apache.hadoop.hdfs.TestModTime
Running org.apache.hadoop.hdfs.TestLease
Tests run: 10, Failures: 0, Errors: 0, Skipped: 0, Time elapsed: 59.394 sec - in org.apache.hadoop.hdfs.TestDFSStripedOutputStreamWithFailure200
Running org.apache.hadoop.hdfs.TestParallelUnixDomainRead
Tests run: 2, Failures: 0, Errors: 0, Skipped: 0, Time elapsed: 11.282 sec - in org.apache.hadoop.hdfs.TestRollingUpgradeDowngrade
Running org.apache.hadoop.hdfs.TestDeprecatedKeys
Tests run: 1, Failures: 0, Errors: 0, Skipped: 0, Time elapsed: 0.494 sec - in org.apache.hadoop.hdfs.TestDeprecatedKeys
Running org.apache.hadoop.hdfs.TestFSOutputSummer
Tests run: 5, Failures: 0, Errors: 0, Skipped: 0, Time elapsed: 14.006 sec - in org.apache.hadoop.hdfs.TestLease
Running org.apache.hadoop.hdfs.TestRead
Tests run: 2, Failures: 0, Errors: 0, Skipped: 0, Time elapsed: 13.33 sec - in org.apache.hadoop.hdfs.TestFSOutputSummer
Tests run: 3, Failures: 0, Errors: 0, Skipped: 0, Time elapsed: 10.043 sec - in org.apache.hadoop.hdfs.TestRead
Running org.apache.hadoop.hdfs.TestFileStatusWithECPolicy
Running org.apache.hadoop.hdfs.TestDFSStripedOutputStreamWithFailure150
Tests run: 1, Failures: 0, Errors: 0, Skipped: 0, Time elapsed: 6.531 sec - in org.apache.hadoop.hdfs.TestFileStatusWithECPolicy
Running org.apache.hadoop.hdfs.TestHDFSPolicyProvider
Tests run: 3, Failures: 0, Errors: 0, Skipped: 0, Time elapsed: 0.223 sec - in org.apache.hadoop.hdfs.TestHDFSPolicyProvider
Running org.apache.hadoop.hdfs.TestAppendSnapshotTruncate
Tests run: 4, Failures: 0, Errors: 0, Skipped: 0, Time elapsed: 41.39 sec - in org.apache.hadoop.hdfs.TestParallelUnixDomainRead
Running org.apache.hadoop.hdfs.TestDFSInotifyEventInputStream
Tests run: 1, Failures: 0, Errors: 0, Skipped: 0, Time elapsed: 31.555 sec - in org.apache.hadoop.hdfs.TestAppendSnapshotTruncate
Running org.apache.hadoop.hdfs.TestDFSStripedOutputStreamWithFailure110
Tests run: 5, Failures: 0, Errors: 0, Skipped: 0, Time elapsed: 25.787 sec - in org.apache.hadoop.hdfs.TestDFSInotifyEventInputStream
Running org.apache.hadoop.hdfs.TestCrcCorruption
Tests run: 10, Failures: 0, Errors: 0, Skipped: 0, Time elapsed: 59.637 sec - in org.apache.hadoop.hdfs.TestDFSStripedOutputStreamWithFailure150
Running org.apache.hadoop.hdfs.TestGetBlocks
Tests run: 4, Failures: 0, Errors: 0, Skipped: 0, Time elapsed: 27.954 sec - in org.apache.hadoop.hdfs.TestCrcCorruption
Running org.apache.hadoop.hdfs.TestDFSStripedOutputStreamWithFailure020
Tests run: 10, Failures: 0, Errors: 0, Skipped: 0, Time elapsed: 0.364 sec - in org.apache.hadoop.hdfs.TestDFSStripedOutputStreamWithFailure020
Running org.apache.hadoop.hdfs.TestDecommissionWithStriped
Tests run: 10, Failures: 0, Errors: 0, Skipped: 0, Time elapsed: 55.492 sec - in org.apache.hadoop.hdfs.TestDFSStripedOutputStreamWithFailure110
Running org.apache.hadoop.hdfs.TestDataTransferProtocol
Tests run: 4, Failures: 0, Errors: 0, Skipped: 0, Time elapsed: 8.766 sec - in org.apache.hadoop.hdfs.TestDataTransferProtocol
Running org.apache.hadoop.hdfs.TestReadWhileWriting
Tests run: 3, Failures: 0, Errors: 0, Skipped: 0, Time elapsed: 45.861 sec - in org.apache.hadoop.hdfs.TestGetBlocks
Running org.apache.hadoop.hdfs.TestDFSStripedOutputStreamWithFailure
Tests run: 1, Failures: 0, Errors: 0, Skipped: 0, Time elapsed: 8.876 sec - in org.apache.hadoop.hdfs.TestReadWhileWriting
Running org.apache.hadoop.hdfs.TestKeyProviderCache
Tests run: 1, Failures: 0, Errors: 0, Skipped: 0, Time elapsed: 0.507 sec - in org.apache.hadoop.hdfs.TestKeyProviderCache
Running org.apache.hadoop.net.TestNetworkTopology
Tests run: 12, Failures: 0, Errors: 0, Skipped: 0, Time elapsed: 10.68 sec - in org.apache.hadoop.net.TestNetworkTopology
Running org.apache.hadoop.tracing.TestTraceAdmin
Tests run: 1, Failures: 0, Errors: 0, Skipped: 0, Time elapsed: 6.822 sec - in org.apache.hadoop.tracing.TestTraceAdmin
Running org.apache.hadoop.tracing.TestTracingShortCircuitLocalRead
Tests run: 1, Failures: 0, Errors: 0, Skipped: 0, Time elapsed: 6.558 sec - in org.apache.hadoop.tracing.TestTracingShortCircuitLocalRead
Tests run: 6, Failures: 0, Errors: 0, Skipped: 0, Time elapsed: 67.355 sec - in org.apache.hadoop.hdfs.TestDecommissionWithStriped
Running org.apache.hadoop.tracing.TestTracing
Running org.apache.hadoop.metrics2.sink.TestRollingFileSystemSinkWithHdfs
Tests run: 1, Failures: 0, Errors: 0, Skipped: 0, Time elapsed: 7.578 sec - in org.apache.hadoop.tracing.TestTracing
Running org.apache.hadoop.metrics2.sink.TestRollingFileSystemSinkWithSecureHdfs
Tests run: 2, Failures: 0, Errors: 0, Skipped: 0, Time elapsed: 13.613 sec - in org.apache.hadoop.metrics2.sink.TestRollingFileSystemSinkWithSecureHdfs
Running org.apache.hadoop.TestRefreshCallQueue
Tests run: 1, Failures: 0, Errors: 0, Skipped: 0, Time elapsed: 5.858 sec - in org.apache.hadoop.TestRefreshCallQueue
Tests run: 11, Failures: 0, Errors: 0, Skipped: 0, Time elapsed: 57.434 sec - in org.apache.hadoop.metrics2.sink.TestRollingFileSystemSinkWithHdfs
Tests run: 4, Failures: 0, Errors: 0, Skipped: 0, Time elapsed: 129.878 sec - in org.apache.hadoop.hdfs.TestDFSStripedOutputStreamWithFailure
Tests run: 2, Failures: 0, Errors: 0, Skipped: 0, Time elapsed: 360.515 sec - in org.apache.hadoop.hdfs.qjournal.client.TestQJMWithFaults

Results :

Failed tests: 
  TestRollingUpgrade.testCheckpointWithMultipleNN:568->testCheckpoint:604 Test resulted
in an unexpected exit
  TestRollingUpgrade.testDFSAdminRollingUpgradeCommands:102->checkMxBeanIsNull:295 expected
null, but was:<javax.management.openmbean.CompositeDataSupport(compositeType=javax.management.openmbean.CompositeType(name=org.apache.hadoop.hdfs.protocol.RollingUpgradeInfo$Bean,items=((itemName=blockPoolId,itemType=javax.management.openmbean.SimpleType(name=java.lang.String)),(itemName=createdRollbackImages,itemType=javax.management.openmbean.SimpleType(name=java.lang.Boolean)),(itemName=finalizeTime,itemType=javax.management.openmbean.SimpleType(name=java.lang.Long)),(itemName=startTime,itemType=javax.management.openmbean.SimpleType(name=java.lang.Long)))),contents={blockPoolId=BP-513863281-67.195.81.152-1464453499988,
createdRollbackImages=true, finalizeTime=0, startTime=1464453501947})>
  TestRollingUpgrade.testRollback:324->checkMxBeanIsNull:295 expected null, but was:<javax.management.openmbean.CompositeDataSupport(compositeType=javax.management.openmbean.CompositeType(name=org.apache.hadoop.hdfs.protocol.RollingUpgradeInfo$Bean,items=((itemName=blockPoolId,itemType=javax.management.openmbean.SimpleType(name=java.lang.String)),(itemName=createdRollbackImages,itemType=javax.management.openmbean.SimpleType(name=java.lang.Boolean)),(itemName=finalizeTime,itemType=javax.management.openmbean.SimpleType(name=java.lang.Long)),(itemName=startTime,itemType=javax.management.openmbean.SimpleType(name=java.lang.Long)))),contents={blockPoolId=BP-513863281-67.195.81.152-1464453499988,
createdRollbackImages=true, finalizeTime=0, startTime=1464453501947})>

Tests run: 4425, Failures: 3, Errors: 0, Skipped: 17

[INFO]                                                                         
[INFO] ------------------------------------------------------------------------
[INFO] Skipping Apache Hadoop HDFS Native Client
[INFO] This project has been banned from the build due to previous failures.
[INFO] ------------------------------------------------------------------------
[INFO]                                                                         
[INFO] ------------------------------------------------------------------------
[INFO] Skipping Apache Hadoop HttpFS
[INFO] This project has been banned from the build due to previous failures.
[INFO] ------------------------------------------------------------------------
[INFO]                                                                         
[INFO] ------------------------------------------------------------------------
[INFO] Skipping Apache Hadoop HDFS BookKeeper Journal
[INFO] This project has been banned from the build due to previous failures.
[INFO] ------------------------------------------------------------------------
[INFO]                                                                         
[INFO] ------------------------------------------------------------------------
[INFO] Skipping Apache Hadoop HDFS-NFS
[INFO] This project has been banned from the build due to previous failures.
[INFO] ------------------------------------------------------------------------
[INFO]                                                                         
[INFO] ------------------------------------------------------------------------
[INFO] Building Apache Hadoop HDFS Project 3.0.0-alpha1-SNAPSHOT
[INFO] ------------------------------------------------------------------------
[INFO] 
[INFO] --- maven-clean-plugin:2.5:clean (default-clean) @ hadoop-hdfs-project ---
[INFO] Deleting <https://builds.apache.org/job/Hadoop-Hdfs-trunk-Java8/ws/source/hadoop-hdfs-project/target>
[INFO] 
[INFO] --- maven-antrun-plugin:1.7:run (create-testdirs) @ hadoop-hdfs-project ---
[INFO] Executing tasks

main:
    [mkdir] Created dir: <https://builds.apache.org/job/Hadoop-Hdfs-trunk-Java8/ws/source/hadoop-hdfs-project/target/test-dir>
[INFO] Executed tasks
[INFO] 
[INFO] --- maven-source-plugin:2.3:jar-no-fork (hadoop-java-sources) @ hadoop-hdfs-project
---
[INFO] 
[INFO] --- maven-source-plugin:2.3:test-jar-no-fork (hadoop-java-sources) @ hadoop-hdfs-project
---
[INFO] 
[INFO] --- maven-enforcer-plugin:1.3.1:enforce (dist-enforce) @ hadoop-hdfs-project ---
[INFO] 
[INFO] --- maven-site-plugin:3.5:attach-descriptor (attach-descriptor) @ hadoop-hdfs-project
---
[INFO] 
[INFO] --- maven-javadoc-plugin:2.8.1:jar (module-javadocs) @ hadoop-hdfs-project ---
[INFO] Not executing Javadoc as the project is not a Java classpath-capable package
[INFO] 
[INFO] --- maven-enforcer-plugin:1.3.1:enforce (depcheck) @ hadoop-hdfs-project ---
[INFO] 
[INFO] --- maven-checkstyle-plugin:2.15:checkstyle (default-cli) @ hadoop-hdfs-project ---
[INFO] 
[INFO] --- findbugs-maven-plugin:3.0.0:findbugs (default-cli) @ hadoop-hdfs-project ---
[INFO] ------------------------------------------------------------------------
[INFO] Reactor Summary:
[INFO] 
[INFO] Apache Hadoop HDFS Client .......................... SUCCESS [04:02 min]
[INFO] Apache Hadoop HDFS ................................. FAILURE [  01:08 h]
[INFO] Apache Hadoop HDFS Native Client ................... SKIPPED
[INFO] Apache Hadoop HttpFS ............................... SKIPPED
[INFO] Apache Hadoop HDFS BookKeeper Journal .............. SKIPPED
[INFO] Apache Hadoop HDFS-NFS ............................. SKIPPED
[INFO] Apache Hadoop HDFS Project ......................... SUCCESS [  0.084 s]
[INFO] ------------------------------------------------------------------------
[INFO] BUILD FAILURE
[INFO] ------------------------------------------------------------------------
[INFO] Total time: 01:13 h
[INFO] Finished at: 2016-05-28T16:58:19+00:00
[INFO] Final Memory: 95M/4030M
[INFO] ------------------------------------------------------------------------
[ERROR] Failed to execute goal org.apache.maven.plugins:maven-surefire-plugin:2.17:test (default-test)
on project hadoop-hdfs: There are test failures.
[ERROR] 
[ERROR] Please refer to <https://builds.apache.org/job/Hadoop-Hdfs-trunk-Java8/ws/source/hadoop-hdfs-project/hadoop-hdfs/target/surefire-reports>
for the individual test results.
[ERROR] -> [Help 1]
[ERROR] 
[ERROR] To see the full stack trace of the errors, re-run Maven with the -e switch.
[ERROR] Re-run Maven using the -X switch to enable full debug logging.
[ERROR] 
[ERROR] For more information about the errors and possible solutions, please read the following
articles:
[ERROR] [Help 1] http://cwiki.apache.org/confluence/display/MAVEN/MojoFailureException
[ERROR] 
[ERROR] After correcting the problems, you can resume the build with the command
[ERROR]   mvn <goals> -rf :hadoop-hdfs
Build step 'Execute shell' marked build as failure
Archiving artifacts
Setting LATEST1_8_HOME=/home/jenkins/jenkins-slave/tools/hudson.model.JDK/latest1.8
Setting MAVEN_3_3_3_HOME=/home/jenkins/jenkins-slave/tools/hudson.tasks.Maven_MavenInstallation/maven-3.3.3
Recording test results
Setting LATEST1_8_HOME=/home/jenkins/jenkins-slave/tools/hudson.model.JDK/latest1.8
Setting MAVEN_3_3_3_HOME=/home/jenkins/jenkins-slave/tools/hudson.tasks.Maven_MavenInstallation/maven-3.3.3
Setting LATEST1_8_HOME=/home/jenkins/jenkins-slave/tools/hudson.model.JDK/latest1.8
Setting MAVEN_3_3_3_HOME=/home/jenkins/jenkins-slave/tools/hudson.tasks.Maven_MavenInstallation/maven-3.3.3

---------------------------------------------------------------------
To unsubscribe, e-mail: hdfs-dev-unsubscribe@hadoop.apache.org
For additional commands, e-mail: hdfs-dev-help@hadoop.apache.org


Mime
View raw message