hadoop-hdfs-dev mailing list archives

Site index · List index
Message view « Date » · « Thread »
Top « Date » · « Thread »
From Apache Jenkins Server <jenk...@builds.apache.org>
Subject Build failed in Jenkins: Hadoop-Hdfs-trunk #3133
Date Thu, 12 May 2016 18:04:39 GMT
See <https://builds.apache.org/job/Hadoop-Hdfs-trunk/3133/changes>

Changes:

[stevel] HADOOP-13116 Jets3tNativeS3FileSystemContractTest does not run.

------------------------------------------
[...truncated 8198 lines...]
Tests run: 14, Failures: 0, Errors: 0, Skipped: 0, Time elapsed: 0.531 sec - in org.apache.hadoop.hdfs.util.TestLightWeightHashSet
Running org.apache.hadoop.hdfs.util.TestCyclicIteration
Tests run: 1, Failures: 0, Errors: 0, Skipped: 0, Time elapsed: 0.153 sec - in org.apache.hadoop.hdfs.util.TestCyclicIteration
Running org.apache.hadoop.hdfs.util.TestDiff
Tests run: 1, Failures: 0, Errors: 0, Skipped: 0, Time elapsed: 5.468 sec - in org.apache.hadoop.hdfs.util.TestDiff
Running org.apache.hadoop.hdfs.TestDFSStartupVersions
Tests run: 7, Failures: 0, Errors: 0, Skipped: 0, Time elapsed: 33.91 sec - in org.apache.hadoop.hdfs.TestFileConcurrentReader
Running org.apache.hadoop.hdfs.TestWriteBlockGetsBlockLengthHint
Tests run: 1, Failures: 0, Errors: 0, Skipped: 0, Time elapsed: 8.568 sec - in org.apache.hadoop.hdfs.TestWriteBlockGetsBlockLengthHint
Running org.apache.hadoop.hdfs.TestReservedRawPaths
Tests run: 1, Failures: 0, Errors: 0, Skipped: 0, Time elapsed: 25.539 sec - in org.apache.hadoop.hdfs.TestDFSStartupVersions
Running org.apache.hadoop.hdfs.TestRead
Tests run: 3, Failures: 0, Errors: 0, Skipped: 0, Time elapsed: 107.868 sec - in org.apache.hadoop.hdfs.TestDFSStorageStateRecovery
Running org.apache.hadoop.hdfs.TestAppendDifferentChecksum
Tests run: 8, Failures: 0, Errors: 0, Skipped: 0, Time elapsed: 19.832 sec - in org.apache.hadoop.hdfs.TestReservedRawPaths
Running org.apache.hadoop.hdfs.TestDFSRollback
Tests run: 3, Failures: 0, Errors: 0, Skipped: 0, Time elapsed: 13.039 sec - in org.apache.hadoop.hdfs.TestRead
Running org.apache.hadoop.hdfs.TestMiniDFSCluster
Tests run: 3, Failures: 0, Errors: 0, Skipped: 1, Time elapsed: 14.371 sec - in org.apache.hadoop.hdfs.TestAppendDifferentChecksum
Running org.apache.hadoop.hdfs.TestClientReportBadBlock
Tests run: 7, Failures: 0, Errors: 0, Skipped: 0, Time elapsed: 20.044 sec - in org.apache.hadoop.hdfs.TestMiniDFSCluster
Running org.apache.hadoop.hdfs.TestFileStatusWithECPolicy
Tests run: 3, Failures: 0, Errors: 0, Skipped: 0, Time elapsed: 17.737 sec - in org.apache.hadoop.hdfs.TestClientReportBadBlock
Tests run: 1, Failures: 0, Errors: 0, Skipped: 0, Time elapsed: 27.181 sec - in org.apache.hadoop.hdfs.TestDFSRollback
Running org.apache.hadoop.hdfs.TestApplyingStoragePolicy
Running org.apache.hadoop.hdfs.TestReadStripedFileWithMissingBlocks
Tests run: 1, Failures: 0, Errors: 0, Skipped: 0, Time elapsed: 9.178 sec - in org.apache.hadoop.hdfs.TestFileStatusWithECPolicy
Running org.apache.hadoop.hdfs.TestLeaseRecovery2
Tests run: 4, Failures: 0, Errors: 0, Skipped: 0, Time elapsed: 14.068 sec - in org.apache.hadoop.hdfs.TestApplyingStoragePolicy
Running org.apache.hadoop.hdfs.protocol.TestLayoutVersion
Tests run: 11, Failures: 0, Errors: 0, Skipped: 0, Time elapsed: 0.511 sec - in org.apache.hadoop.hdfs.protocol.TestLayoutVersion
Running org.apache.hadoop.hdfs.protocol.datatransfer.TestPacketReceiver
Tests run: 1, Failures: 0, Errors: 0, Skipped: 0, Time elapsed: 0.81 sec - in org.apache.hadoop.hdfs.protocol.datatransfer.TestPacketReceiver
Running org.apache.hadoop.hdfs.protocol.datatransfer.sasl.TestSaslDataTransfer
Tests run: 10, Failures: 0, Errors: 0, Skipped: 0, Time elapsed: 128.263 sec - in org.apache.hadoop.hdfs.TestDFSStripedOutputStreamWithFailure180
Running org.apache.hadoop.hdfs.protocol.TestAnnotations
Tests run: 1, Failures: 0, Errors: 0, Skipped: 0, Time elapsed: 0.31 sec - in org.apache.hadoop.hdfs.protocol.TestAnnotations
Running org.apache.hadoop.hdfs.protocol.TestLocatedBlock
Tests run: 1, Failures: 0, Errors: 0, Skipped: 0, Time elapsed: 0.588 sec - in org.apache.hadoop.hdfs.protocol.TestLocatedBlock
Running org.apache.hadoop.hdfs.protocol.TestBlockListAsLongs
Tests run: 7, Failures: 0, Errors: 0, Skipped: 0, Time elapsed: 1.933 sec - in org.apache.hadoop.hdfs.protocol.TestBlockListAsLongs
Running org.apache.hadoop.hdfs.TestAbandonBlock
Tests run: 2, Failures: 0, Errors: 0, Skipped: 0, Time elapsed: 17.272 sec - in org.apache.hadoop.hdfs.TestAbandonBlock
Running org.apache.hadoop.hdfs.TestDFSStripedOutputStreamWithFailure190
Tests run: 1, Failures: 0, Errors: 0, Skipped: 0, Time elapsed: 64.459 sec - in org.apache.hadoop.hdfs.TestReadStripedFileWithMissingBlocks
Running org.apache.hadoop.hdfs.crypto.TestHdfsCryptoStreams
Tests run: 9, Failures: 0, Errors: 0, Skipped: 0, Time elapsed: 52.506 sec - in org.apache.hadoop.hdfs.protocol.datatransfer.sasl.TestSaslDataTransfer
Running org.apache.hadoop.hdfs.TestFileAppendRestart
Tests run: 3, Failures: 0, Errors: 0, Skipped: 0, Time elapsed: 22.574 sec - in org.apache.hadoop.hdfs.TestFileAppendRestart
Running org.apache.hadoop.hdfs.TestFetchImage
Tests run: 1, Failures: 0, Errors: 0, Skipped: 0, Time elapsed: 10.356 sec - in org.apache.hadoop.hdfs.TestFetchImage
Running org.apache.hadoop.hdfs.TestDFSStripedOutputStreamWithFailure200
Tests run: 14, Failures: 0, Errors: 0, Skipped: 0, Time elapsed: 48.509 sec - in org.apache.hadoop.hdfs.crypto.TestHdfsCryptoStreams
Running org.apache.hadoop.hdfs.TestSafeModeWithStripedFile
Tests run: 10, Failures: 0, Errors: 0, Skipped: 0, Time elapsed: 83.744 sec - in org.apache.hadoop.hdfs.TestDFSStripedOutputStreamWithFailure190
Running org.apache.hadoop.hdfs.TestDFSStripedOutputStreamWithFailure170
Tests run: 2, Failures: 0, Errors: 0, Skipped: 0, Time elapsed: 46.337 sec - in org.apache.hadoop.hdfs.TestSafeModeWithStripedFile
Running org.apache.hadoop.hdfs.TestDFSStripedOutputStreamWithFailure010
Tests run: 10, Failures: 0, Errors: 0, Skipped: 0, Time elapsed: 87.535 sec - in org.apache.hadoop.hdfs.TestDFSStripedOutputStreamWithFailure200
Running org.apache.hadoop.hdfs.TestFileCreationDelete
Tests run: 1, Failures: 0, Errors: 0, Skipped: 0, Time elapsed: 22.201 sec - in org.apache.hadoop.hdfs.TestFileCreationDelete
Running org.apache.hadoop.hdfs.TestCrcCorruption
Tests run: 10, Failures: 0, Errors: 0, Skipped: 0, Time elapsed: 85.407 sec - in org.apache.hadoop.hdfs.TestDFSStripedOutputStreamWithFailure170
Running org.apache.hadoop.hdfs.TestHDFSFileSystemContract
Tests run: 10, Failures: 0, Errors: 0, Skipped: 0, Time elapsed: 66.796 sec - in org.apache.hadoop.hdfs.TestDFSStripedOutputStreamWithFailure010
Running org.apache.hadoop.hdfs.TestBlockStoragePolicy
Tests run: 4, Failures: 0, Errors: 0, Skipped: 0, Time elapsed: 36.392 sec - in org.apache.hadoop.hdfs.TestCrcCorruption
Running org.apache.hadoop.hdfs.TestDatanodeDeath
Tests run: 20, Failures: 0, Errors: 0, Skipped: 0, Time elapsed: 55.147 sec - in org.apache.hadoop.hdfs.TestBlockStoragePolicy
Running org.apache.hadoop.hdfs.TestParallelReadUtil
Tests run: 1, Failures: 0, Errors: 0, Skipped: 1, Time elapsed: 0.056 sec - in org.apache.hadoop.hdfs.TestParallelReadUtil
Running org.apache.hadoop.hdfs.TestDFSUpgrade
Tests run: 2, Failures: 0, Errors: 0, Skipped: 0, Time elapsed: 26.877 sec - in org.apache.hadoop.hdfs.TestDFSUpgrade
Running org.apache.hadoop.hdfs.TestDFSShell
Tests run: 4, Failures: 0, Errors: 0, Skipped: 0, Time elapsed: 77.469 sec - in org.apache.hadoop.hdfs.TestDatanodeDeath
Running org.apache.hadoop.hdfs.TestFileAppend2
Tests run: 44, Failures: 0, Errors: 0, Skipped: 0, Time elapsed: 139.668 sec - in org.apache.hadoop.hdfs.TestHDFSFileSystemContract
Running org.apache.hadoop.hdfs.TestKeyProviderCache
Tests run: 1, Failures: 0, Errors: 0, Skipped: 0, Time elapsed: 1.635 sec - in org.apache.hadoop.hdfs.TestKeyProviderCache
Running org.apache.hadoop.hdfs.TestListFilesInDFS
Tests run: 2, Failures: 0, Errors: 0, Skipped: 0, Time elapsed: 11.313 sec - in org.apache.hadoop.hdfs.TestListFilesInDFS
Running org.apache.hadoop.hdfs.TestDFSStripedOutputStreamWithFailure160
Tests run: 10, Failures: 0, Errors: 0, Skipped: 0, Time elapsed: 0.81 sec - in org.apache.hadoop.hdfs.TestDFSStripedOutputStreamWithFailure160
Running org.apache.hadoop.hdfs.TestAppendSnapshotTruncate
Tests run: 5, Failures: 0, Errors: 0, Skipped: 0, Time elapsed: 57.252 sec - in org.apache.hadoop.hdfs.TestFileAppend2
Running org.apache.hadoop.hdfs.TestDFSStripedOutputStreamWithFailure150
Tests run: 10, Failures: 0, Errors: 0, Skipped: 0, Time elapsed: 0.952 sec - in org.apache.hadoop.hdfs.TestDFSStripedOutputStreamWithFailure150
Running org.apache.hadoop.hdfs.TestDFSOutputStream
Tests run: 43, Failures: 0, Errors: 1, Skipped: 0, Time elapsed: 81.64 sec <<< FAILURE!
- in org.apache.hadoop.hdfs.TestDFSShell
testMoveWithTargetPortEmpty(org.apache.hadoop.hdfs.TestDFSShell)  Time elapsed: 0.294 sec
 <<< ERROR!
java.net.BindException: Problem binding to [localhost:9820] java.net.BindException: Address
already in use; For more details see:  http://wiki.apache.org/hadoop/BindException
	at sun.nio.ch.Net.bind0(Native Method)
	at sun.nio.ch.Net.bind(Net.java:444)
	at sun.nio.ch.Net.bind(Net.java:436)
	at sun.nio.ch.ServerSocketChannelImpl.bind(ServerSocketChannelImpl.java:214)
	at sun.nio.ch.ServerSocketAdaptor.bind(ServerSocketAdaptor.java:74)
	at org.apache.hadoop.ipc.Server.bind(Server.java:530)
	at org.apache.hadoop.ipc.Server$Listener.<init>(Server.java:793)
	at org.apache.hadoop.ipc.Server.<init>(Server.java:2592)
	at org.apache.hadoop.ipc.RPC$Server.<init>(RPC.java:958)
	at org.apache.hadoop.ipc.ProtobufRpcEngine$Server.<init>(ProtobufRpcEngine.java:563)
	at org.apache.hadoop.ipc.ProtobufRpcEngine.getServer(ProtobufRpcEngine.java:538)
	at org.apache.hadoop.ipc.RPC$Builder.build(RPC.java:800)
	at org.apache.hadoop.hdfs.server.namenode.NameNodeRpcServer.<init>(NameNodeRpcServer.java:426)
	at org.apache.hadoop.hdfs.server.namenode.NameNode.createRpcServer(NameNode.java:783)
	at org.apache.hadoop.hdfs.server.namenode.NameNode.initialize(NameNode.java:710)
	at org.apache.hadoop.hdfs.server.namenode.NameNode.<init>(NameNode.java:924)
	at org.apache.hadoop.hdfs.server.namenode.NameNode.<init>(NameNode.java:903)
	at org.apache.hadoop.hdfs.server.namenode.NameNode.createNameNode(NameNode.java:1620)
	at org.apache.hadoop.hdfs.MiniDFSCluster.createNameNode(MiniDFSCluster.java:1247)
	at org.apache.hadoop.hdfs.MiniDFSCluster.configureNameService(MiniDFSCluster.java:1016)
	at org.apache.hadoop.hdfs.MiniDFSCluster.createNameNodesAndSetConf(MiniDFSCluster.java:891)
	at org.apache.hadoop.hdfs.MiniDFSCluster.initMiniDFSCluster(MiniDFSCluster.java:823)
	at org.apache.hadoop.hdfs.MiniDFSCluster.<init>(MiniDFSCluster.java:482)
	at org.apache.hadoop.hdfs.MiniDFSCluster$Builder.build(MiniDFSCluster.java:441)
	at org.apache.hadoop.hdfs.TestDFSShell.testMoveWithTargetPortEmpty(TestDFSShell.java:567)

Running org.apache.hadoop.hdfs.TestHDFSServerPorts
Tests run: 4, Failures: 0, Errors: 0, Skipped: 0, Time elapsed: 19.252 sec - in org.apache.hadoop.hdfs.TestDFSOutputStream
Running org.apache.hadoop.hdfs.TestDFSStripedOutputStreamWithFailure060
Tests run: 4, Failures: 0, Errors: 0, Skipped: 0, Time elapsed: 19.502 sec - in org.apache.hadoop.hdfs.TestHDFSServerPorts
Running org.apache.hadoop.hdfs.TestDFSClientExcludedNodes
Tests run: 1, Failures: 0, Errors: 0, Skipped: 0, Time elapsed: 39.21 sec - in org.apache.hadoop.hdfs.TestAppendSnapshotTruncate
Running org.apache.hadoop.hdfs.TestDFSPermission
Tests run: 2, Failures: 0, Errors: 0, Skipped: 0, Time elapsed: 20.777 sec - in org.apache.hadoop.hdfs.TestDFSClientExcludedNodes
Running org.apache.hadoop.hdfs.TestRestartDFS
Tests run: 8, Failures: 0, Errors: 0, Skipped: 0, Time elapsed: 45.695 sec - in org.apache.hadoop.hdfs.TestDFSPermission
Running org.apache.hadoop.cli.TestCryptoAdminCLI
Tests run: 2, Failures: 0, Errors: 0, Skipped: 0, Time elapsed: 30.255 sec - in org.apache.hadoop.hdfs.TestRestartDFS
Running org.apache.hadoop.cli.TestHDFSCLI
Tests run: 1, Failures: 0, Errors: 0, Skipped: 0, Time elapsed: 14.933 sec - in org.apache.hadoop.cli.TestCryptoAdminCLI
Running org.apache.hadoop.cli.TestAclCLI
Tests run: 1, Failures: 0, Errors: 0, Skipped: 0, Time elapsed: 13.851 sec - in org.apache.hadoop.cli.TestAclCLI
Running org.apache.hadoop.cli.TestDeleteCLI
Tests run: 1, Failures: 0, Errors: 0, Skipped: 0, Time elapsed: 16.477 sec - in org.apache.hadoop.cli.TestDeleteCLI
Running org.apache.hadoop.cli.TestCacheAdminCLI
Tests run: 1, Failures: 0, Errors: 0, Skipped: 0, Time elapsed: 13.342 sec - in org.apache.hadoop.cli.TestCacheAdminCLI
Running org.apache.hadoop.cli.TestErasureCodingCLI
Tests run: 10, Failures: 0, Errors: 0, Skipped: 0, Time elapsed: 128.335 sec - in org.apache.hadoop.hdfs.TestDFSStripedOutputStreamWithFailure060
Running org.apache.hadoop.cli.TestXAttrCLI
Tests run: 1, Failures: 0, Errors: 0, Skipped: 0, Time elapsed: 15.705 sec - in org.apache.hadoop.cli.TestErasureCodingCLI
Running org.apache.hadoop.TestRefreshCallQueue
Tests run: 1, Failures: 0, Errors: 0, Skipped: 0, Time elapsed: 12.718 sec - in org.apache.hadoop.cli.TestXAttrCLI
Running org.apache.hadoop.security.TestPermissionSymlinks
Tests run: 1, Failures: 0, Errors: 0, Skipped: 0, Time elapsed: 8.915 sec - in org.apache.hadoop.TestRefreshCallQueue
Running org.apache.hadoop.security.TestPermission
Tests run: 1, Failures: 0, Errors: 0, Skipped: 0, Time elapsed: 89.277 sec - in org.apache.hadoop.cli.TestHDFSCLI
Running org.apache.hadoop.security.TestRefreshUserMappings
Tests run: 15, Failures: 0, Errors: 0, Skipped: 0, Time elapsed: 12.626 sec - in org.apache.hadoop.security.TestPermissionSymlinks
Tests run: 3, Failures: 0, Errors: 0, Skipped: 0, Time elapsed: 14.922 sec - in org.apache.hadoop.security.TestPermission
Tests run: 2, Failures: 0, Errors: 0, Skipped: 0, Time elapsed: 12.833 sec - in org.apache.hadoop.security.TestRefreshUserMappings

Results :

Failed tests: 
  TestNameNodeMetadataConsistency.testGenerationStampInFuture:113 expected:<17> but
was:<0>
  TestBlockManager.testBlockReportQueueing:1074 null

Tests in error: 
  TestRollingFileSystemSinkWithSecureHdfs.testMissingPropertiesWithSecureHDFS:146->createDirectoriesSecurely:192
» IO
  TestAsyncDFSRename.testAggressiveConcurrentAsyncAPI:289->internalTestConcurrentAsyncAPI:328->Object.wait:-2
» 
  TestFileAppend.testMultipleAppends » IO Failed to replace a bad datanode on th...
  TestAsyncDFSRename.testAggressiveConcurrentAsyncRenameWithOverwrite:199->internalTestConcurrentAsyncRenameWithOverwrite:226->Object.wait:-2
» 
  TestSecureNameNode.testName:65 » IO Failed on local exception: java.io.IOExcep...
  TestDFSShell.testMoveWithTargetPortEmpty:567 » Bind Problem binding to [localh...

Tests run: 4411, Failures: 2, Errors: 6, Skipped: 17

[INFO]                                                                         
[INFO] ------------------------------------------------------------------------
[INFO] Skipping Apache Hadoop HDFS Native Client
[INFO] This project has been banned from the build due to previous failures.
[INFO] ------------------------------------------------------------------------
[INFO]                                                                         
[INFO] ------------------------------------------------------------------------
[INFO] Skipping Apache Hadoop HttpFS
[INFO] This project has been banned from the build due to previous failures.
[INFO] ------------------------------------------------------------------------
[INFO]                                                                         
[INFO] ------------------------------------------------------------------------
[INFO] Skipping Apache Hadoop HDFS BookKeeper Journal
[INFO] This project has been banned from the build due to previous failures.
[INFO] ------------------------------------------------------------------------
[INFO]                                                                         
[INFO] ------------------------------------------------------------------------
[INFO] Skipping Apache Hadoop HDFS-NFS
[INFO] This project has been banned from the build due to previous failures.
[INFO] ------------------------------------------------------------------------
[INFO]                                                                         
[INFO] ------------------------------------------------------------------------
[INFO] Building Apache Hadoop HDFS Project 3.0.0-SNAPSHOT
[INFO] ------------------------------------------------------------------------
[INFO] 
[INFO] --- maven-clean-plugin:2.5:clean (default-clean) @ hadoop-hdfs-project ---
[INFO] Deleting <https://builds.apache.org/job/Hadoop-Hdfs-trunk/ws/hadoop-hdfs-project/target>
[INFO] 
[INFO] --- maven-antrun-plugin:1.7:run (create-testdirs) @ hadoop-hdfs-project ---
[INFO] Executing tasks

main:
    [mkdir] Created dir: <https://builds.apache.org/job/Hadoop-Hdfs-trunk/ws/hadoop-hdfs-project/target/test-dir>
[INFO] Executed tasks
[INFO] 
[INFO] --- maven-source-plugin:2.3:jar-no-fork (hadoop-java-sources) @ hadoop-hdfs-project
---
[INFO] 
[INFO] --- maven-source-plugin:2.3:test-jar-no-fork (hadoop-java-sources) @ hadoop-hdfs-project
---
[INFO] 
[INFO] --- maven-enforcer-plugin:1.3.1:enforce (dist-enforce) @ hadoop-hdfs-project ---
[INFO] 
[INFO] --- maven-site-plugin:3.5:attach-descriptor (attach-descriptor) @ hadoop-hdfs-project
---
[INFO] 
[INFO] --- maven-javadoc-plugin:2.8.1:jar (module-javadocs) @ hadoop-hdfs-project ---
[INFO] Skipping javadoc generation
[INFO] 
[INFO] --- maven-enforcer-plugin:1.3.1:enforce (depcheck) @ hadoop-hdfs-project ---
[INFO] 
[INFO] --- maven-checkstyle-plugin:2.15:checkstyle (default-cli) @ hadoop-hdfs-project ---
[INFO] 
[INFO] --- findbugs-maven-plugin:3.0.0:findbugs (default-cli) @ hadoop-hdfs-project ---
[INFO] ------------------------------------------------------------------------
[INFO] Reactor Summary:
[INFO] 
[INFO] Apache Hadoop HDFS Client ......................... SUCCESS [05:22 min]
[INFO] Apache Hadoop HDFS ................................ FAILURE [  01:27 h]
[INFO] Apache Hadoop HDFS Native Client .................. SKIPPED
[INFO] Apache Hadoop HttpFS .............................. SKIPPED
[INFO] Apache Hadoop HDFS BookKeeper Journal ............. SKIPPED
[INFO] Apache Hadoop HDFS-NFS ............................ SKIPPED
[INFO] Apache Hadoop HDFS Project ........................ SUCCESS [  0.139 s]
[INFO] ------------------------------------------------------------------------
[INFO] BUILD FAILURE
[INFO] ------------------------------------------------------------------------
[INFO] Total time: 01:32 h
[INFO] Finished at: 2016-05-12T18:04:38+00:00
[INFO] Final Memory: 72M/801M
[INFO] ------------------------------------------------------------------------
[ERROR] Failed to execute goal org.apache.maven.plugins:maven-surefire-plugin:2.17:test (default-test)
on project hadoop-hdfs: There was a timeout or other error in the fork -> [Help 1]
[ERROR] 
[ERROR] To see the full stack trace of the errors, re-run Maven with the -e switch.
[ERROR] Re-run Maven using the -X switch to enable full debug logging.
[ERROR] 
[ERROR] For more information about the errors and possible solutions, please read the following
articles:
[ERROR] [Help 1] http://cwiki.apache.org/confluence/display/MAVEN/MojoFailureException
[ERROR] 
[ERROR] After correcting the problems, you can resume the build with the command
[ERROR]   mvn <goals> -rf :hadoop-hdfs
Build step 'Execute shell' marked build as failure
Archiving artifacts
Recording test results

---------------------------------------------------------------------
To unsubscribe, e-mail: hdfs-dev-unsubscribe@hadoop.apache.org
For additional commands, e-mail: hdfs-dev-help@hadoop.apache.org


Mime
View raw message