hadoop-hdfs-dev mailing list archives

Site index · List index
Message view « Date » · « Thread »
Top « Date » · « Thread »
From Apache Jenkins Server <jenk...@builds.apache.org>
Subject Build failed in Jenkins: Hadoop-Hdfs-trunk #3136
Date Fri, 13 May 2016 01:12:36 GMT
See <https://builds.apache.org/job/Hadoop-Hdfs-trunk/3136/changes>

Changes:

[wang] Revert "Update project version to 3.0.0-alpha1-SNAPSHOT."

[lei] HDFS-9389. Add maintenance states to AdminStates. (Ming Ma via lei)

------------------------------------------
[...truncated 6202 lines...]
        at sun.misc.Unsafe.park(Native Method)
        at java.util.concurrent.locks.LockSupport.parkNanos(LockSupport.java:226)
        at java.util.concurrent.locks.AbstractQueuedSynchronizer$ConditionObject.awaitNanos(AbstractQueuedSynchronizer.java:2082)
        at java.util.concurrent.LinkedBlockingQueue.poll(LinkedBlockingQueue.java:467)
        at org.apache.hadoop.ipc.CallQueueManager.take(CallQueueManager.java:218)
        at org.apache.hadoop.ipc.Server$Handler.run(Server.java:2387)
"IPC Server handler 5 on 48072" daemon prio=5 tid=152 timed_waiting
java.lang.Thread.State: TIMED_WAITING
        at sun.misc.Unsafe.park(Native Method)
        at java.util.concurrent.locks.LockSupport.parkNanos(LockSupport.java:226)
        at java.util.concurrent.locks.AbstractQueuedSynchronizer$ConditionObject.awaitNanos(AbstractQueuedSynchronizer.java:2082)
        at java.util.concurrent.LinkedBlockingQueue.poll(LinkedBlockingQueue.java:467)
        at org.apache.hadoop.ipc.CallQueueManager.take(CallQueueManager.java:218)
        at org.apache.hadoop.ipc.Server$Handler.run(Server.java:2387)
"VolumeScannerThread(<https://builds.apache.org/job/Hadoop-Hdfs-trunk/ws/hadoop-hdfs-project/hadoop-hdfs/target/test/data/1/dfs/data/data6)">
daemon prio=5 tid=162 timed_waiting
java.lang.Thread.State: TIMED_WAITING
        at java.lang.Object.wait(Native Method)
        at org.apache.hadoop.hdfs.server.datanode.VolumeScanner.run(VolumeScanner.java:613)
"CacheReplicationMonitor(979110695)"  prio=5 tid=6291 timed_waiting
java.lang.Thread.State: TIMED_WAITING
        at sun.misc.Unsafe.park(Native Method)
        at java.util.concurrent.locks.LockSupport.parkNanos(LockSupport.java:226)
        at java.util.concurrent.locks.AbstractQueuedSynchronizer$ConditionObject.await(AbstractQueuedSynchronizer.java:2176)
        at org.apache.hadoop.hdfs.server.blockmanagement.CacheReplicationMonitor.run(CacheReplicationMonitor.java:182)
"IPC Server listener on 48072" daemon prio=5 tid=139 runnable
java.lang.Thread.State: RUNNABLE
        at sun.nio.ch.EPollArrayWrapper.epollWait(Native Method)
        at sun.nio.ch.EPollArrayWrapper.poll(EPollArrayWrapper.java:269)
        at sun.nio.ch.EPollSelectorImpl.doSelect(EPollSelectorImpl.java:79)
        at sun.nio.ch.SelectorImpl.lockAndDoSelect(SelectorImpl.java:87)
        at sun.nio.ch.SelectorImpl.select(SelectorImpl.java:98)
        at sun.nio.ch.SelectorImpl.select(SelectorImpl.java:102)
        at org.apache.hadoop.ipc.Server$Listener.run(Server.java:901)
Tests run: 9, Failures: 0, Errors: 0, Skipped: 0, Time elapsed: 72.568 sec - in org.apache.hadoop.hdfs.TestAclsEndToEnd
Running org.apache.hadoop.hdfs.TestGetFileChecksum
Tests run: 4, Failures: 0, Errors: 0, Skipped: 0, Time elapsed: 20.033 sec - in org.apache.hadoop.hdfs.TestCrcCorruption
Running org.apache.hadoop.hdfs.TestLeaseRecovery2
Tests run: 2, Failures: 0, Errors: 0, Skipped: 0, Time elapsed: 10.324 sec - in org.apache.hadoop.hdfs.TestGetFileChecksum
Running org.apache.hadoop.hdfs.TestDFSStripedOutputStreamWithFailure000
Tests run: 10, Failures: 0, Errors: 0, Skipped: 0, Time elapsed: 35.895 sec - in org.apache.hadoop.hdfs.TestDFSStripedOutputStreamWithFailure000
Running org.apache.hadoop.hdfs.TestWriteConfigurationToDFS
Tests run: 7, Failures: 0, Errors: 0, Skipped: 0, Time elapsed: 105.326 sec - in org.apache.hadoop.hdfs.TestPread
Running org.apache.hadoop.hdfs.TestRollingUpgrade
Tests run: 1, Failures: 0, Errors: 0, Skipped: 0, Time elapsed: 6.763 sec - in org.apache.hadoop.hdfs.TestWriteConfigurationToDFS
Running org.apache.hadoop.hdfs.TestReservedRawPaths
Tests run: 8, Failures: 0, Errors: 0, Skipped: 0, Time elapsed: 13.582 sec - in org.apache.hadoop.hdfs.TestReservedRawPaths
Running org.apache.hadoop.hdfs.TestListFilesInDFS
Tests run: 2, Failures: 0, Errors: 0, Skipped: 0, Time elapsed: 7.349 sec - in org.apache.hadoop.hdfs.TestListFilesInDFS
Running org.apache.hadoop.hdfs.TestParallelShortCircuitReadUnCached
Tests run: 7, Failures: 0, Errors: 0, Skipped: 0, Time elapsed: 74.888 sec - in org.apache.hadoop.hdfs.TestLeaseRecovery2
Running org.apache.hadoop.hdfs.tools.TestDFSHAAdminMiniCluster
Tests run: 6, Failures: 0, Errors: 0, Skipped: 0, Time elapsed: 10.091 sec - in org.apache.hadoop.hdfs.tools.TestDFSHAAdminMiniCluster
Running org.apache.hadoop.hdfs.tools.TestGetConf
Tests run: 10, Failures: 0, Errors: 0, Skipped: 0, Time elapsed: 2.039 sec - in org.apache.hadoop.hdfs.tools.TestGetConf
Running org.apache.hadoop.hdfs.tools.TestStoragePolicyCommands
Tests run: 2, Failures: 0, Errors: 0, Skipped: 0, Time elapsed: 7.447 sec - in org.apache.hadoop.hdfs.tools.TestStoragePolicyCommands
Running org.apache.hadoop.hdfs.tools.TestDFSZKFailoverController
Tests run: 4, Failures: 0, Errors: 0, Skipped: 0, Time elapsed: 17.062 sec - in org.apache.hadoop.hdfs.tools.TestDFSZKFailoverController
Running org.apache.hadoop.hdfs.tools.TestDFSAdmin
Tests run: 4, Failures: 0, Errors: 0, Skipped: 0, Time elapsed: 43.987 sec - in org.apache.hadoop.hdfs.TestParallelShortCircuitReadUnCached
Running org.apache.hadoop.hdfs.tools.offlineImageViewer.TestOfflineImageViewerForXAttr
Tests run: 6, Failures: 0, Errors: 0, Skipped: 0, Time elapsed: 6.417 sec - in org.apache.hadoop.hdfs.tools.offlineImageViewer.TestOfflineImageViewerForXAttr
Running org.apache.hadoop.hdfs.tools.offlineImageViewer.TestOfflineImageViewerWithStripedBlocks
Tests run: 4, Failures: 0, Errors: 0, Skipped: 0, Time elapsed: 9.228 sec - in org.apache.hadoop.hdfs.tools.TestDFSAdmin
Running org.apache.hadoop.hdfs.tools.offlineImageViewer.TestOfflineImageViewer
Tests run: 10, Failures: 0, Errors: 0, Skipped: 0, Time elapsed: 8.852 sec - in org.apache.hadoop.hdfs.tools.offlineImageViewer.TestOfflineImageViewer
Tests run: 7, Failures: 0, Errors: 0, Skipped: 0, Time elapsed: 10.732 sec - in org.apache.hadoop.hdfs.tools.offlineImageViewer.TestOfflineImageViewerWithStripedBlocks
Running org.apache.hadoop.hdfs.tools.offlineImageViewer.TestOfflineImageViewerForContentSummary
Running org.apache.hadoop.hdfs.tools.offlineImageViewer.TestOfflineImageViewerForAcl
Tests run: 6, Failures: 0, Errors: 0, Skipped: 0, Time elapsed: 7.048 sec - in org.apache.hadoop.hdfs.tools.offlineImageViewer.TestOfflineImageViewerForContentSummary
Tests run: 3, Failures: 0, Errors: 0, Skipped: 0, Time elapsed: 6.691 sec - in org.apache.hadoop.hdfs.tools.offlineImageViewer.TestOfflineImageViewerForAcl
Running org.apache.hadoop.hdfs.tools.TestDFSHAAdmin
Running org.apache.hadoop.hdfs.tools.TestDelegationTokenFetcher
Tests run: 20, Failures: 0, Errors: 0, Skipped: 0, Time elapsed: 3.044 sec - in org.apache.hadoop.hdfs.tools.TestDFSHAAdmin
Running org.apache.hadoop.hdfs.tools.TestDebugAdmin
Tests run: 4, Failures: 0, Errors: 0, Skipped: 0, Time elapsed: 5.701 sec - in org.apache.hadoop.hdfs.tools.TestDelegationTokenFetcher
Running org.apache.hadoop.hdfs.tools.TestGetGroups
Tests run: 12, Failures: 0, Errors: 0, Skipped: 0, Time elapsed: 105.091 sec - in org.apache.hadoop.hdfs.TestRollingUpgrade
Running org.apache.hadoop.hdfs.tools.TestDFSAdminWithHA
Tests run: 3, Failures: 0, Errors: 0, Skipped: 0, Time elapsed: 8.241 sec - in org.apache.hadoop.hdfs.tools.TestDebugAdmin
Running org.apache.hadoop.hdfs.tools.offlineEditsViewer.TestOfflineEditsViewer
Tests run: 6, Failures: 0, Errors: 0, Skipped: 0, Time elapsed: 6.983 sec - in org.apache.hadoop.hdfs.tools.TestGetGroups
Running org.apache.hadoop.hdfs.TestHDFSFileSystemContract
Tests run: 11, Failures: 0, Errors: 0, Skipped: 0, Time elapsed: 22.812 sec - in org.apache.hadoop.hdfs.tools.TestDFSAdminWithHA
Running org.apache.hadoop.hdfs.TestClose
Tests run: 5, Failures: 0, Errors: 0, Skipped: 0, Time elapsed: 22.29 sec - in org.apache.hadoop.hdfs.tools.offlineEditsViewer.TestOfflineEditsViewer
Running org.apache.hadoop.hdfs.TestFetchImage
Tests run: 1, Failures: 0, Errors: 0, Skipped: 0, Time elapsed: 6.336 sec - in org.apache.hadoop.hdfs.TestClose
Running org.apache.hadoop.hdfs.TestInjectionForSimulatedStorage
Tests run: 1, Failures: 0, Errors: 0, Skipped: 0, Time elapsed: 6.353 sec - in org.apache.hadoop.hdfs.TestFetchImage
Running org.apache.hadoop.hdfs.TestBlocksScheduledCounter
Tests run: 2, Failures: 0, Errors: 0, Skipped: 0, Time elapsed: 8.051 sec - in org.apache.hadoop.hdfs.TestBlocksScheduledCounter
Running org.apache.hadoop.hdfs.protocolPB.TestPBHelper
Tests run: 30, Failures: 0, Errors: 0, Skipped: 0, Time elapsed: 0.933 sec - in org.apache.hadoop.hdfs.protocolPB.TestPBHelper
Running org.apache.hadoop.hdfs.TestFileAppend
Tests run: 7, Failures: 0, Errors: 1, Skipped: 0, Time elapsed: 258.733 sec <<< FAILURE!
- in org.apache.hadoop.hdfs.TestAsyncDFSRename
testAggressiveConcurrentAsyncAPI(org.apache.hadoop.hdfs.TestAsyncDFSRename)  Time elapsed:
60.012 sec  <<< ERROR!
java.lang.Exception: test timed out after 60000 milliseconds
	at java.lang.Thread.sleep(Native Method)
	at org.apache.hadoop.hdfs.MiniDFSCluster.waitActive(MiniDFSCluster.java:2472)
	at org.apache.hadoop.hdfs.MiniDFSCluster.waitActive(MiniDFSCluster.java:2512)
	at org.apache.hadoop.hdfs.MiniDFSCluster.restartNameNodes(MiniDFSCluster.java:1977)
	at org.apache.hadoop.hdfs.TestAsyncDFSRename.internalTestConcurrentAsyncAPI(TestAsyncDFSRename.java:395)
	at org.apache.hadoop.hdfs.TestAsyncDFSRename.testAggressiveConcurrentAsyncAPI(TestAsyncDFSRename.java:289)

"pool
Running org.apache.hadoop.hdfs.TestRollingUpgradeRollback
Tests run: 1, Failures: 0, Errors: 0, Skipped: 0, Time elapsed: 18.339 sec - in org.apache.hadoop.hdfs.TestInjectionForSimulatedStorage
Running org.apache.hadoop.hdfs.TestLease
Tests run: 3, Failures: 0, Errors: 0, Skipped: 0, Time elapsed: 13.745 sec - in org.apache.hadoop.hdfs.TestRollingUpgradeRollback
Tests run: 5, Failures: 0, Errors: 0, Skipped: 0, Time elapsed: 10.624 sec - in org.apache.hadoop.hdfs.TestLease
Running org.apache.hadoop.net.TestNetworkTopology
Running org.apache.hadoop.TestGenericRefresh
Tests run: 9, Failures: 0, Errors: 0, Skipped: 0, Time elapsed: 6.096 sec - in org.apache.hadoop.TestGenericRefresh
Running org.apache.hadoop.tracing.TestTracingShortCircuitLocalRead
Tests run: 12, Failures: 0, Errors: 0, Skipped: 0, Time elapsed: 11.116 sec - in org.apache.hadoop.net.TestNetworkTopology
Running org.apache.hadoop.tracing.TestTraceAdmin
Tests run: 1, Failures: 0, Errors: 0, Skipped: 0, Time elapsed: 6.581 sec - in org.apache.hadoop.tracing.TestTracingShortCircuitLocalRead
Running org.apache.hadoop.tracing.TestTracing
Tests run: 1, Failures: 0, Errors: 0, Skipped: 0, Time elapsed: 6.644 sec - in org.apache.hadoop.tracing.TestTraceAdmin
Tests run: 12, Failures: 0, Errors: 0, Skipped: 0, Time elapsed: 37.355 sec - in org.apache.hadoop.hdfs.TestFileAppend
Running org.apache.hadoop.metrics2.sink.TestRollingFileSystemSinkWithHdfs
Running org.apache.hadoop.metrics2.sink.TestRollingFileSystemSinkWithSecureHdfs
Tests run: 1, Failures: 0, Errors: 0, Skipped: 0, Time elapsed: 7.725 sec - in org.apache.hadoop.tracing.TestTracing
Running org.apache.hadoop.cli.TestDeleteCLI
Tests run: 44, Failures: 0, Errors: 0, Skipped: 0, Time elapsed: 88.073 sec - in org.apache.hadoop.hdfs.TestHDFSFileSystemContract
Running org.apache.hadoop.cli.TestHDFSCLI
Tests run: 1, Failures: 0, Errors: 0, Skipped: 0, Time elapsed: 10.383 sec - in org.apache.hadoop.cli.TestDeleteCLI
Running org.apache.hadoop.cli.TestAclCLI
Tests run: 1, Failures: 0, Errors: 0, Skipped: 0, Time elapsed: 8.105 sec - in org.apache.hadoop.cli.TestAclCLI
Running org.apache.hadoop.cli.TestErasureCodingCLI
Tests run: 2, Failures: 0, Errors: 0, Skipped: 0, Time elapsed: 29.486 sec - in org.apache.hadoop.metrics2.sink.TestRollingFileSystemSinkWithSecureHdfs
Running org.apache.hadoop.cli.TestCacheAdminCLI
Tests run: 1, Failures: 0, Errors: 0, Skipped: 0, Time elapsed: 9.018 sec - in org.apache.hadoop.cli.TestErasureCodingCLI
Running org.apache.hadoop.cli.TestXAttrCLI
Tests run: 1, Failures: 0, Errors: 0, Skipped: 0, Time elapsed: 9.074 sec - in org.apache.hadoop.cli.TestCacheAdminCLI
Running org.apache.hadoop.cli.TestCryptoAdminCLI
Tests run: 1, Failures: 0, Errors: 0, Skipped: 0, Time elapsed: 9.439 sec - in org.apache.hadoop.cli.TestXAttrCLI
Running org.apache.hadoop.security.TestPermission
Tests run: 11, Failures: 0, Errors: 0, Skipped: 0, Time elapsed: 44.091 sec - in org.apache.hadoop.metrics2.sink.TestRollingFileSystemSinkWithHdfs
Running org.apache.hadoop.security.TestRefreshUserMappings
Tests run: 1, Failures: 0, Errors: 0, Skipped: 0, Time elapsed: 8.815 sec - in org.apache.hadoop.cli.TestCryptoAdminCLI
Running org.apache.hadoop.security.TestPermissionSymlinks
Tests run: 3, Failures: 0, Errors: 0, Skipped: 0, Time elapsed: 8.467 sec - in org.apache.hadoop.security.TestPermission
Tests run: 2, Failures: 0, Errors: 0, Skipped: 0, Time elapsed: 7.978 sec - in org.apache.hadoop.security.TestRefreshUserMappings
Running org.apache.hadoop.tools.TestTools
Running org.apache.hadoop.tools.TestHdfsConfigFields
Tests run: 3, Failures: 0, Errors: 0, Skipped: 0, Time elapsed: 1.068 sec - in org.apache.hadoop.tools.TestHdfsConfigFields
Running org.apache.hadoop.tools.TestJMXGet
Tests run: 5, Failures: 0, Errors: 0, Skipped: 0, Time elapsed: 2.272 sec - in org.apache.hadoop.tools.TestTools
Tests run: 15, Failures: 0, Errors: 0, Skipped: 0, Time elapsed: 7.739 sec - in org.apache.hadoop.security.TestPermissionSymlinks
Tests run: 2, Failures: 0, Errors: 0, Skipped: 0, Time elapsed: 7.872 sec - in org.apache.hadoop.tools.TestJMXGet
Tests run: 1, Failures: 0, Errors: 0, Skipped: 0, Time elapsed: 66.425 sec - in org.apache.hadoop.cli.TestHDFSCLI

Results :

Failed tests: 
  TestEditLog.testBatchedSyncWithClosedLogs:594 logging edit without syncing should do not
affect txid expected:<1> but was:<2>

Tests in error: 
  TestNameNodeRespectsBindHostKeys.testServiceRpcBindHostKey:144 » Bind Problem ...
  TestAsyncDFSRename.testAggressiveConcurrentAsyncAPI:289->internalTestConcurrentAsyncAPI:395
» 

Tests run: 4418, Failures: 1, Errors: 2, Skipped: 17

[INFO]                                                                         
[INFO] ------------------------------------------------------------------------
[INFO] Skipping Apache Hadoop HDFS Native Client
[INFO] This project has been banned from the build due to previous failures.
[INFO] ------------------------------------------------------------------------
[INFO]                                                                         
[INFO] ------------------------------------------------------------------------
[INFO] Skipping Apache Hadoop HttpFS
[INFO] This project has been banned from the build due to previous failures.
[INFO] ------------------------------------------------------------------------
[INFO]                                                                         
[INFO] ------------------------------------------------------------------------
[INFO] Skipping Apache Hadoop HDFS BookKeeper Journal
[INFO] This project has been banned from the build due to previous failures.
[INFO] ------------------------------------------------------------------------
[INFO]                                                                         
[INFO] ------------------------------------------------------------------------
[INFO] Skipping Apache Hadoop HDFS-NFS
[INFO] This project has been banned from the build due to previous failures.
[INFO] ------------------------------------------------------------------------
[INFO]                                                                         
[INFO] ------------------------------------------------------------------------
[INFO] Building Apache Hadoop HDFS Project 3.0.0-SNAPSHOT
[INFO] ------------------------------------------------------------------------
[INFO] 
[INFO] --- maven-clean-plugin:2.5:clean (default-clean) @ hadoop-hdfs-project ---
[INFO] Deleting <https://builds.apache.org/job/Hadoop-Hdfs-trunk/ws/hadoop-hdfs-project/target>
[INFO] 
[INFO] --- maven-antrun-plugin:1.7:run (create-testdirs) @ hadoop-hdfs-project ---
[INFO] Executing tasks

main:
    [mkdir] Created dir: <https://builds.apache.org/job/Hadoop-Hdfs-trunk/ws/hadoop-hdfs-project/target/test-dir>
[INFO] Executed tasks
[INFO] 
[INFO] --- maven-source-plugin:2.3:jar-no-fork (hadoop-java-sources) @ hadoop-hdfs-project
---
[INFO] 
[INFO] --- maven-source-plugin:2.3:test-jar-no-fork (hadoop-java-sources) @ hadoop-hdfs-project
---
[INFO] 
[INFO] --- maven-enforcer-plugin:1.3.1:enforce (dist-enforce) @ hadoop-hdfs-project ---
[INFO] 
[INFO] --- maven-site-plugin:3.5:attach-descriptor (attach-descriptor) @ hadoop-hdfs-project
---
[INFO] 
[INFO] --- maven-javadoc-plugin:2.8.1:jar (module-javadocs) @ hadoop-hdfs-project ---
[INFO] Skipping javadoc generation
[INFO] 
[INFO] --- maven-enforcer-plugin:1.3.1:enforce (depcheck) @ hadoop-hdfs-project ---
[INFO] 
[INFO] --- maven-checkstyle-plugin:2.15:checkstyle (default-cli) @ hadoop-hdfs-project ---
[INFO] 
[INFO] --- findbugs-maven-plugin:3.0.0:findbugs (default-cli) @ hadoop-hdfs-project ---
[INFO] ------------------------------------------------------------------------
[INFO] Reactor Summary:
[INFO] 
[INFO] Apache Hadoop HDFS Client ......................... SUCCESS [04:06 min]
[INFO] Apache Hadoop HDFS ................................ FAILURE [  01:00 h]
[INFO] Apache Hadoop HDFS Native Client .................. SKIPPED
[INFO] Apache Hadoop HttpFS .............................. SKIPPED
[INFO] Apache Hadoop HDFS BookKeeper Journal ............. SKIPPED
[INFO] Apache Hadoop HDFS-NFS ............................ SKIPPED
[INFO] Apache Hadoop HDFS Project ........................ SUCCESS [  0.100 s]
[INFO] ------------------------------------------------------------------------
[INFO] BUILD FAILURE
[INFO] ------------------------------------------------------------------------
[INFO] Total time: 01:04 h
[INFO] Finished at: 2016-05-13T01:12:36+00:00
[INFO] Final Memory: 57M/730M
[INFO] ------------------------------------------------------------------------
[ERROR] Failed to execute goal org.apache.maven.plugins:maven-surefire-plugin:2.17:test (default-test)
on project hadoop-hdfs: There are test failures.
[ERROR] 
[ERROR] Please refer to <https://builds.apache.org/job/Hadoop-Hdfs-trunk/ws/hadoop-hdfs-project/hadoop-hdfs/target/surefire-reports>
for the individual test results.
[ERROR] -> [Help 1]
[ERROR] 
[ERROR] To see the full stack trace of the errors, re-run Maven with the -e switch.
[ERROR] Re-run Maven using the -X switch to enable full debug logging.
[ERROR] 
[ERROR] For more information about the errors and possible solutions, please read the following
articles:
[ERROR] [Help 1] http://cwiki.apache.org/confluence/display/MAVEN/MojoFailureException
[ERROR] 
[ERROR] After correcting the problems, you can resume the build with the command
[ERROR]   mvn <goals> -rf :hadoop-hdfs
Build step 'Execute shell' marked build as failure
Archiving artifacts
Recording test results

---------------------------------------------------------------------
To unsubscribe, e-mail: hdfs-dev-unsubscribe@hadoop.apache.org
For additional commands, e-mail: hdfs-dev-help@hadoop.apache.org


Mime
View raw message