hadoop-hdfs-dev mailing list archives

Site index · List index
Message view « Date » · « Thread »
Top « Date » · « Thread »
From Apache Jenkins Server <jenk...@builds.apache.org>
Subject Build failed in Jenkins: Hadoop-Hdfs-trunk #3132
Date Thu, 12 May 2016 15:34:34 GMT
See <https://builds.apache.org/job/Hadoop-Hdfs-trunk/3132/changes>

Changes:

[stevel] HADOOP-13122 Customize User-Agent header sent in HTTP requests by S3A.

------------------------------------------
[...truncated 5719 lines...]
Tests run: 1, Failures: 0, Errors: 0, Skipped: 0, Time elapsed: 20.724 sec - in org.apache.hadoop.hdfs.TestSetrepDecreasing
Running org.apache.hadoop.hdfs.TestRead
Running org.apache.hadoop.hdfs.TestHttpPolicy
Tests run: 1, Failures: 0, Errors: 0, Skipped: 0, Time elapsed: 0.965 sec - in org.apache.hadoop.hdfs.TestHttpPolicy
Running org.apache.hadoop.hdfs.TestDFSStripedOutputStreamWithFailure040
Tests run: 10, Failures: 0, Errors: 0, Skipped: 0, Time elapsed: 0.582 sec - in org.apache.hadoop.hdfs.TestDFSStripedOutputStreamWithFailure040
Running org.apache.hadoop.hdfs.TestWriteBlockGetsBlockLengthHint
Tests run: 1, Failures: 0, Errors: 0, Skipped: 0, Time elapsed: 7.497 sec - in org.apache.hadoop.hdfs.TestWriteBlockGetsBlockLengthHint
Running org.apache.hadoop.hdfs.TestLocalDFS
Tests run: 3, Failures: 0, Errors: 0, Skipped: 0, Time elapsed: 11.751 sec - in org.apache.hadoop.hdfs.TestRead
Running org.apache.hadoop.hdfs.TestBlocksScheduledCounter
Tests run: 10, Failures: 0, Errors: 0, Skipped: 0, Time elapsed: 101.474 sec - in org.apache.hadoop.hdfs.TestDFSStripedOutputStreamWithFailure160
Running org.apache.hadoop.hdfs.TestApplyingStoragePolicy
Tests run: 2, Failures: 0, Errors: 0, Skipped: 0, Time elapsed: 8.542 sec - in org.apache.hadoop.hdfs.TestBlocksScheduledCounter
Tests run: 2, Failures: 0, Errors: 0, Skipped: 0, Time elapsed: 9.737 sec - in org.apache.hadoop.hdfs.TestLocalDFS
Running org.apache.hadoop.hdfs.TestSetrepIncreasing
Running org.apache.hadoop.hdfs.TestDecommission
Tests run: 4, Failures: 0, Errors: 0, Skipped: 0, Time elapsed: 11.011 sec - in org.apache.hadoop.hdfs.TestApplyingStoragePolicy
Running org.apache.hadoop.hdfs.TestMultiThreadedHflush
Tests run: 3, Failures: 0, Errors: 0, Skipped: 0, Time elapsed: 18.541 sec - in org.apache.hadoop.hdfs.TestMultiThreadedHflush
Tests run: 10, Failures: 0, Errors: 0, Skipped: 0, Time elapsed: 57.249 sec - in org.apache.hadoop.hdfs.TestDFSStripedOutputStreamWithFailure110
Running org.apache.hadoop.hdfs.TestMissingBlocksAlert
Running org.apache.hadoop.hdfs.TestDFSUpgradeFromImage
Tests run: 1, Failures: 0, Errors: 0, Skipped: 0, Time elapsed: 8.179 sec - in org.apache.hadoop.hdfs.TestMissingBlocksAlert
Running org.apache.hadoop.hdfs.TestFileStatus
Tests run: 3, Failures: 0, Errors: 0, Skipped: 0, Time elapsed: 37.099 sec - in org.apache.hadoop.hdfs.TestSetrepIncreasing
Running org.apache.hadoop.hdfs.TestDFSStripedOutputStreamWithFailure150
Tests run: 5, Failures: 0, Errors: 0, Skipped: 0, Time elapsed: 6.656 sec - in org.apache.hadoop.hdfs.TestFileStatus
Running org.apache.hadoop.hdfs.TestBalancerBandwidth
Tests run: 8, Failures: 0, Errors: 0, Skipped: 0, Time elapsed: 19.205 sec - in org.apache.hadoop.hdfs.TestDFSUpgradeFromImage
Running org.apache.hadoop.hdfs.TestDFSStripedOutputStreamWithFailure060
Tests run: 10, Failures: 0, Errors: 0, Skipped: 0, Time elapsed: 0.574 sec - in org.apache.hadoop.hdfs.TestDFSStripedOutputStreamWithFailure060
Running org.apache.hadoop.hdfs.TestSetTimes
Tests run: 1, Failures: 0, Errors: 0, Skipped: 0, Time elapsed: 17.16 sec - in org.apache.hadoop.hdfs.TestBalancerBandwidth
Running org.apache.hadoop.TestGenericRefresh
Tests run: 4, Failures: 0, Errors: 0, Skipped: 0, Time elapsed: 14.751 sec - in org.apache.hadoop.hdfs.TestSetTimes
Running org.apache.hadoop.tracing.TestTracing
Tests run: 9, Failures: 0, Errors: 0, Skipped: 0, Time elapsed: 7.633 sec - in org.apache.hadoop.TestGenericRefresh
Running org.apache.hadoop.tracing.TestTracingShortCircuitLocalRead
Tests run: 1, Failures: 0, Errors: 0, Skipped: 0, Time elapsed: 10.048 sec - in org.apache.hadoop.tracing.TestTracing
Running org.apache.hadoop.tracing.TestTraceAdmin
Tests run: 1, Failures: 0, Errors: 0, Skipped: 0, Time elapsed: 8.044 sec - in org.apache.hadoop.tracing.TestTracingShortCircuitLocalRead
Running org.apache.hadoop.security.TestPermission
Tests run: 1, Failures: 0, Errors: 0, Skipped: 0, Time elapsed: 7.68 sec - in org.apache.hadoop.tracing.TestTraceAdmin
Running org.apache.hadoop.security.TestPermissionSymlinks
Tests run: 3, Failures: 0, Errors: 0, Skipped: 0, Time elapsed: 9.69 sec - in org.apache.hadoop.security.TestPermission
Running org.apache.hadoop.security.TestRefreshUserMappings
Tests run: 15, Failures: 0, Errors: 0, Skipped: 0, Time elapsed: 10.064 sec - in org.apache.hadoop.security.TestPermissionSymlinks
Running org.apache.hadoop.fs.TestFcHdfsSetUMask
Tests run: 2, Failures: 0, Errors: 0, Skipped: 0, Time elapsed: 10.317 sec - in org.apache.hadoop.security.TestRefreshUserMappings
Running org.apache.hadoop.fs.TestSymlinkHdfsFileSystem
Tests run: 10, Failures: 0, Errors: 0, Skipped: 0, Time elapsed: 60.474 sec - in org.apache.hadoop.hdfs.TestDFSStripedOutputStreamWithFailure150
Running org.apache.hadoop.fs.loadGenerator.TestLoadGenerator
Tests run: 12, Failures: 0, Errors: 0, Skipped: 0, Time elapsed: 9.101 sec - in org.apache.hadoop.fs.TestFcHdfsSetUMask
Running org.apache.hadoop.fs.contract.hdfs.TestHDFSContractRename
Tests run: 6, Failures: 0, Errors: 0, Skipped: 0, Time elapsed: 8.799 sec - in org.apache.hadoop.fs.contract.hdfs.TestHDFSContractRename
Running org.apache.hadoop.fs.contract.hdfs.TestHDFSContractDelete
Tests run: 74, Failures: 0, Errors: 0, Skipped: 2, Time elapsed: 17.148 sec - in org.apache.hadoop.fs.TestSymlinkHdfsFileSystem
Running org.apache.hadoop.fs.contract.hdfs.TestHDFSContractAppend
Tests run: 8, Failures: 0, Errors: 0, Skipped: 0, Time elapsed: 7.122 sec - in org.apache.hadoop.fs.contract.hdfs.TestHDFSContractDelete
Running org.apache.hadoop.fs.contract.hdfs.TestHDFSContractOpen
Tests run: 2, Failures: 0, Errors: 0, Skipped: 0, Time elapsed: 19.135 sec - in org.apache.hadoop.fs.loadGenerator.TestLoadGenerator
Running org.apache.hadoop.fs.contract.hdfs.TestHDFSContractGetFileStatus
Tests run: 5, Failures: 0, Errors: 0, Skipped: 0, Time elapsed: 7.946 sec - in org.apache.hadoop.fs.contract.hdfs.TestHDFSContractAppend
Running org.apache.hadoop.fs.contract.hdfs.TestHDFSContractConcat
Tests run: 2, Failures: 0, Errors: 0, Skipped: 0, Time elapsed: 6.12 sec - in org.apache.hadoop.fs.contract.hdfs.TestHDFSContractGetFileStatus
Tests run: 6, Failures: 0, Errors: 0, Skipped: 0, Time elapsed: 7.558 sec - in org.apache.hadoop.fs.contract.hdfs.TestHDFSContractOpen
Running org.apache.hadoop.fs.contract.hdfs.TestHDFSContractMkdir
Running org.apache.hadoop.fs.contract.hdfs.TestHDFSContractCreate
Tests run: 4, Failures: 0, Errors: 0, Skipped: 0, Time elapsed: 8.802 sec - in org.apache.hadoop.fs.contract.hdfs.TestHDFSContractConcat
Running org.apache.hadoop.fs.contract.hdfs.TestHDFSContractRootDirectory
Tests run: 5, Failures: 0, Errors: 0, Skipped: 0, Time elapsed: 8.183 sec - in org.apache.hadoop.fs.contract.hdfs.TestHDFSContractMkdir
Running org.apache.hadoop.fs.contract.hdfs.TestHDFSContractSeek
Tests run: 6, Failures: 0, Errors: 0, Skipped: 0, Time elapsed: 9.859 sec - in org.apache.hadoop.fs.contract.hdfs.TestHDFSContractCreate
Running org.apache.hadoop.fs.contract.hdfs.TestHDFSContractSetTimes
Tests run: 6, Failures: 0, Errors: 0, Skipped: 0, Time elapsed: 6.675 sec - in org.apache.hadoop.fs.contract.hdfs.TestHDFSContractRootDirectory
Running org.apache.hadoop.fs.TestEnhancedByteBufferAccess
Tests run: 1, Failures: 0, Errors: 0, Skipped: 0, Time elapsed: 5.622 sec - in org.apache.hadoop.fs.contract.hdfs.TestHDFSContractSetTimes
Running org.apache.hadoop.fs.permission.TestStickyBit
Tests run: 18, Failures: 0, Errors: 0, Skipped: 0, Time elapsed: 10.33 sec - in org.apache.hadoop.fs.contract.hdfs.TestHDFSContractSeek
Running org.apache.hadoop.fs.TestSymlinkHdfsDisable
Tests run: 1, Failures: 0, Errors: 0, Skipped: 0, Time elapsed: 5.077 sec - in org.apache.hadoop.fs.TestSymlinkHdfsDisable
Running org.apache.hadoop.fs.TestHDFSFileContextMainOperations
Tests run: 6, Failures: 0, Errors: 0, Skipped: 0, Time elapsed: 9.636 sec - in org.apache.hadoop.fs.permission.TestStickyBit
Running org.apache.hadoop.fs.TestWebHdfsFileContextMainOperations
Tests run: 10, Failures: 0, Errors: 0, Skipped: 1, Time elapsed: 16.408 sec - in org.apache.hadoop.fs.TestEnhancedByteBufferAccess
Running org.apache.hadoop.fs.TestSWebHdfsFileContextMainOperations
Tests run: 69, Failures: 0, Errors: 0, Skipped: 0, Time elapsed: 11.474 sec - in org.apache.hadoop.fs.TestHDFSFileContextMainOperations
Running org.apache.hadoop.fs.TestSymlinkHdfsFileContext
Tests run: 61, Failures: 0, Errors: 0, Skipped: 0, Time elapsed: 11.293 sec - in org.apache.hadoop.fs.TestWebHdfsFileContextMainOperations
Running org.apache.hadoop.fs.TestUnbuffer
Tests run: 2, Failures: 0, Errors: 0, Skipped: 0, Time elapsed: 8.284 sec - in org.apache.hadoop.fs.TestUnbuffer
Running org.apache.hadoop.fs.shell.TestHdfsTextCommand
Tests run: 71, Failures: 0, Errors: 0, Skipped: 0, Time elapsed: 12.983 sec - in org.apache.hadoop.fs.TestSymlinkHdfsFileContext
Running org.apache.hadoop.fs.TestResolveHdfsSymlink
Tests run: 1, Failures: 0, Errors: 0, Skipped: 0, Time elapsed: 5.358 sec - in org.apache.hadoop.fs.shell.TestHdfsTextCommand
Running org.apache.hadoop.fs.TestFcHdfsCreateMkdir
Tests run: 4, Failures: 0, Errors: 0, Skipped: 0, Time elapsed: 4.849 sec - in org.apache.hadoop.fs.TestResolveHdfsSymlink
Running org.apache.hadoop.fs.TestFcHdfsPermission
Tests run: 8, Failures: 0, Errors: 0, Skipped: 0, Time elapsed: 5.525 sec - in org.apache.hadoop.fs.TestFcHdfsCreateMkdir
Tests run: 19, Failures: 0, Errors: 0, Skipped: 1, Time elapsed: 185.349 sec - in org.apache.hadoop.hdfs.TestDecommission
Running org.apache.hadoop.fs.TestGlobPaths
Running org.apache.hadoop.fs.TestUrlStreamHandler
Tests run: 4, Failures: 0, Errors: 0, Skipped: 0, Time elapsed: 5.838 sec - in org.apache.hadoop.fs.TestFcHdfsPermission
Running org.apache.hadoop.fs.viewfs.TestViewFileSystemAtHdfsRoot
Tests run: 2, Failures: 0, Errors: 0, Skipped: 0, Time elapsed: 6.136 sec - in org.apache.hadoop.fs.TestUrlStreamHandler
Tests run: 37, Failures: 0, Errors: 0, Skipped: 6, Time elapsed: 6.601 sec - in org.apache.hadoop.fs.TestGlobPaths
Running org.apache.hadoop.fs.viewfs.TestViewFsWithAcls
Running org.apache.hadoop.fs.viewfs.TestViewFsDefaultValue
Tests run: 1, Failures: 0, Errors: 0, Skipped: 0, Time elapsed: 6.027 sec - in org.apache.hadoop.fs.viewfs.TestViewFsWithAcls
Tests run: 7, Failures: 0, Errors: 0, Skipped: 0, Time elapsed: 6.126 sec - in org.apache.hadoop.fs.viewfs.TestViewFsDefaultValue
Running org.apache.hadoop.fs.viewfs.TestViewFileSystemWithAcls
Running org.apache.hadoop.fs.viewfs.TestViewFileSystemHdfs
Tests run: 1, Failures: 0, Errors: 0, Skipped: 0, Time elapsed: 5.898 sec - in org.apache.hadoop.fs.viewfs.TestViewFileSystemWithAcls
Running org.apache.hadoop.fs.viewfs.TestViewFsAtHdfsRoot
Tests run: 60, Failures: 0, Errors: 0, Skipped: 0, Time elapsed: 17.126 sec - in org.apache.hadoop.fs.viewfs.TestViewFileSystemAtHdfsRoot
Running org.apache.hadoop.fs.viewfs.TestViewFsFileStatusHdfs
Tests run: 2, Failures: 0, Errors: 0, Skipped: 0, Time elapsed: 4.813 sec - in org.apache.hadoop.fs.viewfs.TestViewFsFileStatusHdfs
Running org.apache.hadoop.fs.viewfs.TestViewFileSystemWithXAttrs
Tests run: 58, Failures: 0, Errors: 0, Skipped: 0, Time elapsed: 10.232 sec - in org.apache.hadoop.fs.viewfs.TestViewFsAtHdfsRoot
Tests run: 60, Failures: 0, Errors: 0, Skipped: 0, Time elapsed: 16.486 sec - in org.apache.hadoop.fs.viewfs.TestViewFileSystemHdfs
Running org.apache.hadoop.fs.viewfs.TestViewFsWithXAttrs
Running org.apache.hadoop.fs.viewfs.TestViewFsHdfs
Tests run: 1, Failures: 0, Errors: 0, Skipped: 0, Time elapsed: 5.546 sec - in org.apache.hadoop.fs.viewfs.TestViewFileSystemWithXAttrs
Running org.apache.hadoop.fs.TestHdfsNativeCodeLoader
Tests run: 1, Failures: 0, Errors: 0, Skipped: 0, Time elapsed: 0.252 sec - in org.apache.hadoop.fs.TestHdfsNativeCodeLoader
Running org.apache.hadoop.metrics2.sink.TestRollingFileSystemSinkWithSecureHdfs
Tests run: 1, Failures: 0, Errors: 0, Skipped: 0, Time elapsed: 5.684 sec - in org.apache.hadoop.fs.viewfs.TestViewFsWithXAttrs
Running org.apache.hadoop.metrics2.sink.TestRollingFileSystemSinkWithHdfs
Tests run: 58, Failures: 0, Errors: 0, Skipped: 0, Time elapsed: 9.996 sec - in org.apache.hadoop.fs.viewfs.TestViewFsHdfs
Running org.apache.hadoop.tools.TestJMXGet
Tests run: 2, Failures: 0, Errors: 0, Skipped: 0, Time elapsed: 6.706 sec - in org.apache.hadoop.tools.TestJMXGet
Running org.apache.hadoop.tools.TestTools
Tests run: 5, Failures: 0, Errors: 0, Skipped: 0, Time elapsed: 2.066 sec - in org.apache.hadoop.tools.TestTools
Running org.apache.hadoop.tools.TestHdfsConfigFields
Tests run: 3, Failures: 0, Errors: 0, Skipped: 0, Time elapsed: 1.02 sec - in org.apache.hadoop.tools.TestHdfsConfigFields
Running org.apache.hadoop.TestRefreshCallQueue
Tests run: 2, Failures: 0, Errors: 0, Skipped: 0, Time elapsed: 20.746 sec - in org.apache.hadoop.metrics2.sink.TestRollingFileSystemSinkWithSecureHdfs
Running org.apache.hadoop.net.TestNetworkTopology
Tests run: 1, Failures: 0, Errors: 0, Skipped: 0, Time elapsed: 5.334 sec - in org.apache.hadoop.TestRefreshCallQueue
Running org.apache.hadoop.cli.TestCacheAdminCLI
Tests run: 12, Failures: 0, Errors: 0, Skipped: 0, Time elapsed: 9.842 sec - in org.apache.hadoop.net.TestNetworkTopology
Running org.apache.hadoop.cli.TestCryptoAdminCLI
Tests run: 1, Failures: 0, Errors: 0, Skipped: 0, Time elapsed: 7.513 sec - in org.apache.hadoop.cli.TestCacheAdminCLI
Running org.apache.hadoop.cli.TestDeleteCLI
Tests run: 61, Failures: 0, Errors: 0, Skipped: 0, Time elapsed: 101.915 sec - in org.apache.hadoop.fs.TestSWebHdfsFileContextMainOperations
Tests run: 1, Failures: 0, Errors: 0, Skipped: 0, Time elapsed: 7.913 sec - in org.apache.hadoop.cli.TestCryptoAdminCLI
Running org.apache.hadoop.cli.TestAclCLI
Running org.apache.hadoop.cli.TestErasureCodingCLI
Tests run: 1, Failures: 0, Errors: 0, Skipped: 0, Time elapsed: 8.131 sec - in org.apache.hadoop.cli.TestDeleteCLI
Running org.apache.hadoop.cli.TestXAttrCLI
Tests run: 11, Failures: 0, Errors: 0, Skipped: 0, Time elapsed: 40.237 sec - in org.apache.hadoop.metrics2.sink.TestRollingFileSystemSinkWithHdfs
Running org.apache.hadoop.cli.TestHDFSCLI
Tests run: 1, Failures: 0, Errors: 0, Skipped: 0, Time elapsed: 7.33 sec - in org.apache.hadoop.cli.TestAclCLI
Tests run: 1, Failures: 0, Errors: 0, Skipped: 0, Time elapsed: 9.075 sec - in org.apache.hadoop.cli.TestErasureCodingCLI
Tests run: 1, Failures: 0, Errors: 0, Skipped: 0, Time elapsed: 8.304 sec - in org.apache.hadoop.cli.TestXAttrCLI
Tests run: 1, Failures: 0, Errors: 0, Skipped: 0, Time elapsed: 59.772 sec - in org.apache.hadoop.cli.TestHDFSCLI

Results :

Tests in error: 
  TestFsDatasetCache.testPageRounder:476 ยป Timeout Timed out waiting for conditi...

Tests run: 4418, Failures: 0, Errors: 1, Skipped: 17

[INFO]                                                                         
[INFO] ------------------------------------------------------------------------
[INFO] Skipping Apache Hadoop HDFS Native Client
[INFO] This project has been banned from the build due to previous failures.
[INFO] ------------------------------------------------------------------------
[INFO]                                                                         
[INFO] ------------------------------------------------------------------------
[INFO] Skipping Apache Hadoop HttpFS
[INFO] This project has been banned from the build due to previous failures.
[INFO] ------------------------------------------------------------------------
[INFO]                                                                         
[INFO] ------------------------------------------------------------------------
[INFO] Skipping Apache Hadoop HDFS BookKeeper Journal
[INFO] This project has been banned from the build due to previous failures.
[INFO] ------------------------------------------------------------------------
[INFO]                                                                         
[INFO] ------------------------------------------------------------------------
[INFO] Skipping Apache Hadoop HDFS-NFS
[INFO] This project has been banned from the build due to previous failures.
[INFO] ------------------------------------------------------------------------
[INFO]                                                                         
[INFO] ------------------------------------------------------------------------
[INFO] Building Apache Hadoop HDFS Project 3.0.0-SNAPSHOT
[INFO] ------------------------------------------------------------------------
[INFO] 
[INFO] --- maven-clean-plugin:2.5:clean (default-clean) @ hadoop-hdfs-project ---
[INFO] Deleting <https://builds.apache.org/job/Hadoop-Hdfs-trunk/ws/hadoop-hdfs-project/target>
[INFO] 
[INFO] --- maven-antrun-plugin:1.7:run (create-testdirs) @ hadoop-hdfs-project ---
[INFO] Executing tasks

main:
    [mkdir] Created dir: <https://builds.apache.org/job/Hadoop-Hdfs-trunk/ws/hadoop-hdfs-project/target/test-dir>
[INFO] Executed tasks
[INFO] 
[INFO] --- maven-source-plugin:2.3:jar-no-fork (hadoop-java-sources) @ hadoop-hdfs-project
---
[INFO] 
[INFO] --- maven-source-plugin:2.3:test-jar-no-fork (hadoop-java-sources) @ hadoop-hdfs-project
---
[INFO] 
[INFO] --- maven-enforcer-plugin:1.3.1:enforce (dist-enforce) @ hadoop-hdfs-project ---
[INFO] 
[INFO] --- maven-site-plugin:3.5:attach-descriptor (attach-descriptor) @ hadoop-hdfs-project
---
[INFO] 
[INFO] --- maven-javadoc-plugin:2.8.1:jar (module-javadocs) @ hadoop-hdfs-project ---
[INFO] Skipping javadoc generation
[INFO] 
[INFO] --- maven-enforcer-plugin:1.3.1:enforce (depcheck) @ hadoop-hdfs-project ---
[INFO] 
[INFO] --- maven-checkstyle-plugin:2.15:checkstyle (default-cli) @ hadoop-hdfs-project ---
[INFO] 
[INFO] --- findbugs-maven-plugin:3.0.0:findbugs (default-cli) @ hadoop-hdfs-project ---
[INFO] ------------------------------------------------------------------------
[INFO] Reactor Summary:
[INFO] 
[INFO] Apache Hadoop HDFS Client ......................... SUCCESS [05:05 min]
[INFO] Apache Hadoop HDFS ................................ FAILURE [  01:05 h]
[INFO] Apache Hadoop HDFS Native Client .................. SKIPPED
[INFO] Apache Hadoop HttpFS .............................. SKIPPED
[INFO] Apache Hadoop HDFS BookKeeper Journal ............. SKIPPED
[INFO] Apache Hadoop HDFS-NFS ............................ SKIPPED
[INFO] Apache Hadoop HDFS Project ........................ SUCCESS [  0.101 s]
[INFO] ------------------------------------------------------------------------
[INFO] BUILD FAILURE
[INFO] ------------------------------------------------------------------------
[INFO] Total time: 01:10 h
[INFO] Finished at: 2016-05-12T15:34:35+00:00
[INFO] Final Memory: 60M/900M
[INFO] ------------------------------------------------------------------------
[ERROR] Failed to execute goal org.apache.maven.plugins:maven-surefire-plugin:2.17:test (default-test)
on project hadoop-hdfs: There are test failures.
[ERROR] 
[ERROR] Please refer to <https://builds.apache.org/job/Hadoop-Hdfs-trunk/ws/hadoop-hdfs-project/hadoop-hdfs/target/surefire-reports>
for the individual test results.
[ERROR] -> [Help 1]
[ERROR] 
[ERROR] To see the full stack trace of the errors, re-run Maven with the -e switch.
[ERROR] Re-run Maven using the -X switch to enable full debug logging.
[ERROR] 
[ERROR] For more information about the errors and possible solutions, please read the following
articles:
[ERROR] [Help 1] http://cwiki.apache.org/confluence/display/MAVEN/MojoFailureException
[ERROR] 
[ERROR] After correcting the problems, you can resume the build with the command
[ERROR]   mvn <goals> -rf :hadoop-hdfs
Build step 'Execute shell' marked build as failure
Archiving artifacts
Recording test results

---------------------------------------------------------------------
To unsubscribe, e-mail: hdfs-dev-unsubscribe@hadoop.apache.org
For additional commands, e-mail: hdfs-dev-help@hadoop.apache.org


Mime
View raw message