hadoop-hdfs-dev mailing list archives

Site index · List index
Message view « Date » · « Thread »
Top « Date » · « Thread »
From Apache Jenkins Server <jenk...@builds.apache.org>
Subject Hadoop-Hdfs-trunk-Java8 - Build # 1183 - Still Failing
Date Sun, 08 May 2016 18:53:17 GMT
See https://builds.apache.org/job/Hadoop-Hdfs-trunk-Java8/1183/

###################################################################################
########################## LAST 60 LINES OF THE CONSOLE ###########################
[...truncated 6093 lines...]
[INFO] 
[INFO] --- maven-antrun-plugin:1.7:run (create-testdirs) @ hadoop-hdfs-project ---
[INFO] Executing tasks

main:
    [mkdir] Created dir: /home/jenkins/jenkins-slave/workspace/Hadoop-Hdfs-trunk-Java8/hadoop-hdfs-project/target/test-dir
[INFO] Executed tasks
[INFO] 
[INFO] --- maven-source-plugin:2.3:jar-no-fork (hadoop-java-sources) @ hadoop-hdfs-project
---
[INFO] 
[INFO] --- maven-source-plugin:2.3:test-jar-no-fork (hadoop-java-sources) @ hadoop-hdfs-project
---
[INFO] 
[INFO] --- maven-enforcer-plugin:1.3.1:enforce (dist-enforce) @ hadoop-hdfs-project ---
[INFO] 
[INFO] --- maven-site-plugin:3.5:attach-descriptor (attach-descriptor) @ hadoop-hdfs-project
---
[INFO] 
[INFO] --- maven-javadoc-plugin:2.8.1:jar (module-javadocs) @ hadoop-hdfs-project ---
[INFO] Not executing Javadoc as the project is not a Java classpath-capable package
[INFO] 
[INFO] --- maven-enforcer-plugin:1.3.1:enforce (depcheck) @ hadoop-hdfs-project ---
[INFO] 
[INFO] --- maven-checkstyle-plugin:2.15:checkstyle (default-cli) @ hadoop-hdfs-project ---
[INFO] 
[INFO] --- findbugs-maven-plugin:3.0.0:findbugs (default-cli) @ hadoop-hdfs-project ---
[INFO] ------------------------------------------------------------------------
[INFO] Reactor Summary:
[INFO] 
[INFO] Apache Hadoop HDFS Client ......................... SUCCESS [04:14 min]
[INFO] Apache Hadoop HDFS ................................ FAILURE [  01:02 h]
[INFO] Apache Hadoop HDFS Native Client .................. SKIPPED
[INFO] Apache Hadoop HttpFS .............................. SKIPPED
[INFO] Apache Hadoop HDFS BookKeeper Journal ............. SKIPPED
[INFO] Apache Hadoop HDFS-NFS ............................ SKIPPED
[INFO] Apache Hadoop HDFS Project ........................ SUCCESS [  0.121 s]
[INFO] ------------------------------------------------------------------------
[INFO] BUILD FAILURE
[INFO] ------------------------------------------------------------------------
[INFO] Total time: 01:06 h
[INFO] Finished at: 2016-05-08T18:53:08+00:00
[INFO] Final Memory: 64M/947M
[INFO] ------------------------------------------------------------------------
[ERROR] Failed to execute goal org.apache.maven.plugins:maven-surefire-plugin:2.17:test (default-test)
on project hadoop-hdfs: ExecutionException: java.lang.RuntimeException: The forked VM terminated
without properly saying goodbye. VM crash or System.exit called?
[ERROR] Command was /bin/sh -c cd /home/jenkins/jenkins-slave/workspace/Hadoop-Hdfs-trunk-Java8/hadoop-hdfs-project/hadoop-hdfs
&& /home/jenkins/tools/java/jdk1.8.0/jre/bin/java -Xmx2048m -XX:MaxPermSize=768m -XX:+HeapDumpOnOutOfMemoryError
-DminiClusterDedicatedDirs=true -jar /home/jenkins/jenkins-slave/workspace/Hadoop-Hdfs-trunk-Java8/hadoop-hdfs-project/hadoop-hdfs/target/surefire/surefirebooter5305235290102482077.jar
/home/jenkins/jenkins-slave/workspace/Hadoop-Hdfs-trunk-Java8/hadoop-hdfs-project/hadoop-hdfs/target/surefire/surefire850706552651653943tmp
/home/jenkins/jenkins-slave/workspace/Hadoop-Hdfs-trunk-Java8/hadoop-hdfs-project/hadoop-hdfs/target/surefire/surefire_2487200204431515748593tmp
[ERROR] -> [Help 1]
[ERROR] 
[ERROR] To see the full stack trace of the errors, re-run Maven with the -e switch.
[ERROR] Re-run Maven using the -X switch to enable full debug logging.
[ERROR] 
[ERROR] For more information about the errors and possible solutions, please read the following
articles:
[ERROR] [Help 1] http://cwiki.apache.org/confluence/display/MAVEN/MojoFailureException
[ERROR] 
[ERROR] After correcting the problems, you can resume the build with the command
[ERROR]   mvn <goals> -rf :hadoop-hdfs
Build step 'Execute shell' marked build as failure
Archiving artifacts
Recording test results
Sending e-mails to: hdfs-dev@hadoop.apache.org
Email was triggered for: Failure - Any
Sending email for trigger: Failure - Any



###################################################################################
############################## FAILED TESTS (if any) ##############################
6 tests failed.
FAILED:  org.apache.hadoop.hdfs.TestDFSInotifyEventInputStream.testBasic

Error Message:
org/apache/hadoop/ha/HAServiceProtocol$StateChangeRequestInfo

Stack Trace:
java.lang.NoClassDefFoundError: org/apache/hadoop/ha/HAServiceProtocol$StateChangeRequestInfo
	at java.net.URLClassLoader$1.run(URLClassLoader.java:372)
	at java.net.URLClassLoader$1.run(URLClassLoader.java:361)
	at java.security.AccessController.doPrivileged(Native Method)
	at java.net.URLClassLoader.findClass(URLClassLoader.java:360)
	at java.lang.ClassLoader.loadClass(ClassLoader.java:424)
	at sun.misc.Launcher$AppClassLoader.loadClass(Launcher.java:308)
	at java.lang.ClassLoader.loadClass(ClassLoader.java:357)
	at org.apache.hadoop.hdfs.MiniDFSCluster.transitionToActive(MiniDFSCluster.java:2423)
	at org.apache.hadoop.hdfs.TestDFSInotifyEventInputStream.testBasic(TestDFSInotifyEventInputStream.java:98)


FAILED:  org.apache.hadoop.hdfs.TestDFSInotifyEventInputStream.testReadEventsWithTimeout

Error Message:
org/apache/hadoop/ha/HAServiceProtocol$StateChangeRequestInfo

Stack Trace:
java.lang.NoClassDefFoundError: org/apache/hadoop/ha/HAServiceProtocol$StateChangeRequestInfo
	at org.apache.hadoop.hdfs.MiniDFSCluster.transitionToActive(MiniDFSCluster.java:2423)
	at org.apache.hadoop.hdfs.TestDFSInotifyEventInputStream.testReadEventsWithTimeout(TestDFSInotifyEventInputStream.java:498)


FAILED:  org.apache.hadoop.hdfs.TestDFSInotifyEventInputStream.testNNFailover

Error Message:
org/apache/hadoop/ha/HAServiceProtocol$StateChangeRequestInfo

Stack Trace:
java.lang.NoClassDefFoundError: org/apache/hadoop/ha/HAServiceProtocol$StateChangeRequestInfo
	at org.apache.hadoop.hdfs.MiniDFSCluster.transitionToActive(MiniDFSCluster.java:2423)
	at org.apache.hadoop.hdfs.TestDFSInotifyEventInputStream.testNNFailover(TestDFSInotifyEventInputStream.java:421)


FAILED:  org.apache.hadoop.hdfs.TestDFSInotifyEventInputStream.testTwoActiveNNs

Error Message:
org/apache/hadoop/ha/HAServiceProtocol$StateChangeRequestInfo

Stack Trace:
java.lang.NoClassDefFoundError: org/apache/hadoop/ha/HAServiceProtocol$StateChangeRequestInfo
	at org.apache.hadoop.hdfs.MiniDFSCluster.transitionToActive(MiniDFSCluster.java:2423)
	at org.apache.hadoop.hdfs.TestDFSInotifyEventInputStream.testTwoActiveNNs(TestDFSInotifyEventInputStream.java:453)


FAILED:  org.apache.hadoop.hdfs.server.blockmanagement.TestComputeInvalidateWork.testDatanodeReRegistration

Error Message:
org/apache/hadoop/fs/FileSystem$Statistics$StatisticsDataReference

Stack Trace:
java.lang.NoClassDefFoundError: org/apache/hadoop/fs/FileSystem$Statistics$StatisticsDataReference
	at java.net.URLClassLoader$1.run(URLClassLoader.java:372)
	at java.net.URLClassLoader$1.run(URLClassLoader.java:361)
	at java.security.AccessController.doPrivileged(Native Method)
	at java.net.URLClassLoader.findClass(URLClassLoader.java:360)
	at java.lang.ClassLoader.loadClass(ClassLoader.java:424)
	at sun.misc.Launcher$AppClassLoader.loadClass(Launcher.java:308)
	at java.lang.ClassLoader.loadClass(ClassLoader.java:357)
	at org.apache.hadoop.fs.FileSystem$Statistics.getThreadStatistics(FileSystem.java:3252)
	at org.apache.hadoop.fs.FileSystem$Statistics.incrementWriteOps(FileSystem.java:3298)
	at org.apache.hadoop.hdfs.DistributedFileSystem.mkdirsInternal(DistributedFileSystem.java:1074)
	at org.apache.hadoop.hdfs.DistributedFileSystem.mkdirs(DistributedFileSystem.java:1069)
	at org.apache.hadoop.fs.FileSystem.mkdirs(FileSystem.java:1908)
	at org.apache.hadoop.hdfs.DFSTestUtil.createFile(DFSTestUtil.java:388)
	at org.apache.hadoop.hdfs.DFSTestUtil.createFile(DFSTestUtil.java:379)
	at org.apache.hadoop.hdfs.DFSTestUtil.createFile(DFSTestUtil.java:372)
	at org.apache.hadoop.hdfs.DFSTestUtil.createFile(DFSTestUtil.java:365)
	at org.apache.hadoop.hdfs.server.blockmanagement.TestComputeInvalidateWork.testDatanodeReRegistration(TestComputeInvalidateWork.java:147)


FAILED:  org.apache.hadoop.hdfs.server.namenode.TestEditLog.testBatchedSyncWithClosedLogs[1]

Error Message:
logging edit without syncing should do not affect txid expected:<1> but was:<2>

Stack Trace:
java.lang.AssertionError: logging edit without syncing should do not affect txid expected:<1>
but was:<2>
	at org.junit.Assert.fail(Assert.java:88)
	at org.junit.Assert.failNotEquals(Assert.java:743)
	at org.junit.Assert.assertEquals(Assert.java:118)
	at org.junit.Assert.assertEquals(Assert.java:555)
	at org.apache.hadoop.hdfs.server.namenode.TestEditLog.testBatchedSyncWithClosedLogs(TestEditLog.java:594)




Mime
View raw message