hadoop-hdfs-dev mailing list archives

Site index · List index
Message view « Date » · « Thread »
Top « Date » · « Thread »
From Apache Jenkins Server <jenk...@builds.apache.org>
Subject Build failed in Jenkins: Hadoop-Hdfs-trunk-Java8 #1262
Date Wed, 25 May 2016 06:47:20 GMT
See <https://builds.apache.org/job/Hadoop-Hdfs-trunk-Java8/1262/changes>

Changes:

[rohithsharmaks] YARN-5024.

------------------------------------------
[...truncated 5261 lines...]
Tests run: 2, Failures: 0, Errors: 0, Skipped: 0, Time elapsed: 5.509 sec - in org.apache.hadoop.fs.TestUrlStreamHandler
Running org.apache.hadoop.fs.TestUnbuffer
Tests run: 74, Failures: 0, Errors: 0, Skipped: 2, Time elapsed: 15.904 sec - in org.apache.hadoop.fs.TestSymlinkHdfsFileSystem
Running org.apache.hadoop.fs.TestFcHdfsCreateMkdir
Tests run: 2, Failures: 0, Errors: 0, Skipped: 0, Time elapsed: 7.857 sec - in org.apache.hadoop.fs.TestUnbuffer
Tests run: 8, Failures: 0, Errors: 0, Skipped: 0, Time elapsed: 5.735 sec - in org.apache.hadoop.fs.TestFcHdfsCreateMkdir
Running org.apache.hadoop.fs.TestEnhancedByteBufferAccess
Running org.apache.hadoop.fs.TestHdfsNativeCodeLoader
Tests run: 1, Failures: 0, Errors: 0, Skipped: 0, Time elapsed: 0.227 sec - in org.apache.hadoop.fs.TestHdfsNativeCodeLoader
ERROR: Could not install LATEST1_8_HOME
java.lang.NullPointerException
	at hudson.plugins.toolenv.ToolEnvBuildWrapper$1.buildEnvVars(ToolEnvBuildWrapper.java:46)
	at hudson.model.AbstractBuild.getEnvironment(AbstractBuild.java:947)
	at hudson.plugins.git.GitSCM.getParamExpandedRepos(GitSCM.java:390)
	at hudson.plugins.git.GitSCM.compareRemoteRevisionWithImpl(GitSCM.java:577)
	at hudson.plugins.git.GitSCM.compareRemoteRevisionWith(GitSCM.java:527)
	at hudson.scm.SCM.compareRemoteRevisionWith(SCM.java:381)
	at hudson.scm.SCM.poll(SCM.java:398)
	at hudson.model.AbstractProject._poll(AbstractProject.java:1453)
	at hudson.model.AbstractProject.poll(AbstractProject.java:1356)
	at hudson.triggers.SCMTrigger$Runner.runPolling(SCMTrigger.java:526)
	at hudson.triggers.SCMTrigger$Runner.run(SCMTrigger.java:555)
	at hudson.util.SequentialExecutionQueue$QueueEntry.run(SequentialExecutionQueue.java:119)
	at java.util.concurrent.Executors$RunnableAdapter.call(Executors.java:471)
	at java.util.concurrent.FutureTask.run(FutureTask.java:262)
	at java.util.concurrent.ThreadPoolExecutor.runWorker(ThreadPoolExecutor.java:1145)
	at java.util.concurrent.ThreadPoolExecutor$Worker.run(ThreadPoolExecutor.java:615)
	at java.lang.Thread.run(Thread.java:745)
ERROR: Could not install MAVEN_3_3_3_HOME
java.lang.NullPointerException
	at hudson.plugins.toolenv.ToolEnvBuildWrapper$1.buildEnvVars(ToolEnvBuildWrapper.java:46)
	at hudson.model.AbstractBuild.getEnvironment(AbstractBuild.java:947)
	at hudson.plugins.git.GitSCM.getParamExpandedRepos(GitSCM.java:390)
	at hudson.plugins.git.GitSCM.compareRemoteRevisionWithImpl(GitSCM.java:577)
	at hudson.plugins.git.GitSCM.compareRemoteRevisionWith(GitSCM.java:527)
	at hudson.scm.SCM.compareRemoteRevisionWith(SCM.java:381)
	at hudson.scm.SCM.poll(SCM.java:398)
	at hudson.model.AbstractProject._poll(AbstractProject.java:1453)
	at hudson.model.AbstractProject.poll(AbstractProject.java:1356)
	at hudson.triggers.SCMTrigger$Runner.runPolling(SCMTrigger.java:526)
	at hudson.triggers.SCMTrigger$Runner.run(SCMTrigger.java:555)
	at hudson.util.SequentialExecutionQueue$QueueEntry.run(SequentialExecutionQueue.java:119)
	at java.util.concurrent.Executors$RunnableAdapter.call(Executors.java:471)
	at java.util.concurrent.FutureTask.run(FutureTask.java:262)
	at java.util.concurrent.ThreadPoolExecutor.runWorker(ThreadPoolExecutor.java:1145)
	at java.util.concurrent.ThreadPoolExecutor$Worker.run(ThreadPoolExecutor.java:615)
	at java.lang.Thread.run(Thread.java:745)
Running org.apache.hadoop.fs.TestHDFSFileContextMainOperations
Tests run: 69, Failures: 0, Errors: 0, Skipped: 0, Time elapsed: 15.639 sec - in org.apache.hadoop.fs.TestHDFSFileContextMainOperations
Tests run: 10, Failures: 0, Errors: 0, Skipped: 1, Time elapsed: 16.346 sec - in org.apache.hadoop.fs.TestEnhancedByteBufferAccess
Running org.apache.hadoop.fs.shell.TestHdfsTextCommand
Running org.apache.hadoop.fs.TestSWebHdfsFileContextMainOperations
Tests run: 1, Failures: 0, Errors: 0, Skipped: 0, Time elapsed: 5.556 sec - in org.apache.hadoop.fs.shell.TestHdfsTextCommand
Running org.apache.hadoop.fs.TestResolveHdfsSymlink
Tests run: 4, Failures: 0, Errors: 0, Skipped: 0, Time elapsed: 5.185 sec - in org.apache.hadoop.fs.TestResolveHdfsSymlink
Running org.apache.hadoop.fs.TestWebHdfsFileContextMainOperations
Tests run: 32, Failures: 0, Errors: 0, Skipped: 0, Time elapsed: 309.708 sec - in org.apache.hadoop.hdfs.server.balancer.TestBalancer
Running org.apache.hadoop.fs.viewfs.TestViewFsWithAcls
Tests run: 61, Failures: 0, Errors: 0, Skipped: 0, Time elapsed: 15.364 sec - in org.apache.hadoop.fs.TestSWebHdfsFileContextMainOperations
Running org.apache.hadoop.fs.viewfs.TestViewFsFileStatusHdfs
Tests run: 1, Failures: 0, Errors: 0, Skipped: 0, Time elapsed: 6.41 sec - in org.apache.hadoop.fs.viewfs.TestViewFsWithAcls
Running org.apache.hadoop.fs.viewfs.TestViewFileSystemHdfs
Tests run: 2, Failures: 0, Errors: 0, Skipped: 0, Time elapsed: 5.61 sec - in org.apache.hadoop.fs.viewfs.TestViewFsFileStatusHdfs
Running org.apache.hadoop.fs.viewfs.TestViewFsWithXAttrs
Tests run: 61, Failures: 0, Errors: 0, Skipped: 0, Time elapsed: 13.34 sec - in org.apache.hadoop.fs.TestWebHdfsFileContextMainOperations
Running org.apache.hadoop.fs.viewfs.TestViewFsAtHdfsRoot
Tests run: 1, Failures: 0, Errors: 0, Skipped: 0, Time elapsed: 6.049 sec - in org.apache.hadoop.fs.viewfs.TestViewFsWithXAttrs
Running org.apache.hadoop.fs.viewfs.TestViewFsHdfs
Tests run: 58, Failures: 0, Errors: 0, Skipped: 0, Time elapsed: 11.35 sec - in org.apache.hadoop.fs.viewfs.TestViewFsAtHdfsRoot
Running org.apache.hadoop.fs.viewfs.TestViewFileSystemWithAcls
Tests run: 60, Failures: 0, Errors: 0, Skipped: 0, Time elapsed: 18.058 sec - in org.apache.hadoop.fs.viewfs.TestViewFileSystemHdfs
Running org.apache.hadoop.fs.viewfs.TestViewFileSystemAtHdfsRoot
Tests run: 58, Failures: 0, Errors: 0, Skipped: 0, Time elapsed: 11.658 sec - in org.apache.hadoop.fs.viewfs.TestViewFsHdfs
Running org.apache.hadoop.fs.viewfs.TestViewFileSystemWithXAttrs
Tests run: 1, Failures: 0, Errors: 0, Skipped: 0, Time elapsed: 5.799 sec - in org.apache.hadoop.fs.viewfs.TestViewFileSystemWithAcls
Running org.apache.hadoop.fs.viewfs.TestViewFsDefaultValue
Tests run: 10, Failures: 0, Errors: 0, Skipped: 0, Time elapsed: 119.519 sec - in org.apache.hadoop.hdfs.TestDFSStripedOutputStreamWithFailure170
Running org.apache.hadoop.fs.TestSymlinkHdfsFileContext
Tests run: 1, Failures: 0, Errors: 0, Skipped: 0, Time elapsed: 5.985 sec - in org.apache.hadoop.fs.viewfs.TestViewFileSystemWithXAttrs
Running org.apache.hadoop.fs.contract.hdfs.TestHDFSContractDelete
Tests run: 7, Failures: 0, Errors: 0, Skipped: 0, Time elapsed: 5.276 sec - in org.apache.hadoop.fs.viewfs.TestViewFsDefaultValue
Running org.apache.hadoop.fs.contract.hdfs.TestHDFSContractSetTimes
Tests run: 8, Failures: 0, Errors: 0, Skipped: 0, Time elapsed: 6.211 sec - in org.apache.hadoop.fs.contract.hdfs.TestHDFSContractDelete
Running org.apache.hadoop.fs.contract.hdfs.TestHDFSContractMkdir
Tests run: 1, Failures: 0, Errors: 0, Skipped: 0, Time elapsed: 5.092 sec - in org.apache.hadoop.fs.contract.hdfs.TestHDFSContractSetTimes
Running org.apache.hadoop.fs.contract.hdfs.TestHDFSContractOpen
Tests run: 5, Failures: 0, Errors: 0, Skipped: 0, Time elapsed: 6.056 sec - in org.apache.hadoop.fs.contract.hdfs.TestHDFSContractMkdir
Running org.apache.hadoop.fs.contract.hdfs.TestHDFSContractRootDirectory
Tests run: 6, Failures: 0, Errors: 0, Skipped: 0, Time elapsed: 5.913 sec - in org.apache.hadoop.fs.contract.hdfs.TestHDFSContractOpen
Tests run: 60, Failures: 0, Errors: 0, Skipped: 0, Time elapsed: 22.665 sec - in org.apache.hadoop.fs.viewfs.TestViewFileSystemAtHdfsRoot
Running org.apache.hadoop.fs.contract.hdfs.TestHDFSContractAppend
Running org.apache.hadoop.fs.contract.hdfs.TestHDFSContractCreate
Tests run: 6, Failures: 0, Errors: 0, Skipped: 0, Time elapsed: 5.191 sec - in org.apache.hadoop.fs.contract.hdfs.TestHDFSContractRootDirectory
Running org.apache.hadoop.fs.contract.hdfs.TestHDFSContractSeek
Tests run: 71, Failures: 0, Errors: 0, Skipped: 0, Time elapsed: 20.693 sec - in org.apache.hadoop.fs.TestSymlinkHdfsFileContext
Running org.apache.hadoop.fs.contract.hdfs.TestHDFSContractRename
Tests run: 5, Failures: 0, Errors: 0, Skipped: 0, Time elapsed: 6.541 sec - in org.apache.hadoop.fs.contract.hdfs.TestHDFSContractAppend
Tests run: 6, Failures: 0, Errors: 0, Skipped: 0, Time elapsed: 6.713 sec - in org.apache.hadoop.fs.contract.hdfs.TestHDFSContractCreate
Running org.apache.hadoop.fs.contract.hdfs.TestHDFSContractGetFileStatus
Running org.apache.hadoop.fs.contract.hdfs.TestHDFSContractConcat
Tests run: 6, Failures: 0, Errors: 0, Skipped: 0, Time elapsed: 6.947 sec - in org.apache.hadoop.fs.contract.hdfs.TestHDFSContractRename
Tests run: 2, Failures: 0, Errors: 0, Skipped: 0, Time elapsed: 5.677 sec - in org.apache.hadoop.fs.contract.hdfs.TestHDFSContractGetFileStatus
Running org.apache.hadoop.fs.permission.TestStickyBit
Running org.apache.hadoop.metrics2.sink.TestRollingFileSystemSinkWithHdfs
Tests run: 18, Failures: 0, Errors: 0, Skipped: 0, Time elapsed: 10.078 sec - in org.apache.hadoop.fs.contract.hdfs.TestHDFSContractSeek
Tests run: 4, Failures: 0, Errors: 0, Skipped: 0, Time elapsed: 7.359 sec - in org.apache.hadoop.fs.contract.hdfs.TestHDFSContractConcat
Running org.apache.hadoop.metrics2.sink.TestRollingFileSystemSinkWithSecureHdfs
Running org.apache.hadoop.TestRefreshCallQueue
Tests run: 1, Failures: 0, Errors: 0, Skipped: 0, Time elapsed: 6.486 sec - in org.apache.hadoop.TestRefreshCallQueue
Running org.apache.hadoop.security.TestPermissionSymlinks
Tests run: 6, Failures: 0, Errors: 0, Skipped: 0, Time elapsed: 12.426 sec - in org.apache.hadoop.fs.permission.TestStickyBit
Running org.apache.hadoop.security.TestRefreshUserMappings
Tests run: 15, Failures: 0, Errors: 0, Skipped: 0, Time elapsed: 7.057 sec - in org.apache.hadoop.security.TestPermissionSymlinks
Tests run: 2, Failures: 0, Errors: 0, Skipped: 0, Time elapsed: 15 sec - in org.apache.hadoop.metrics2.sink.TestRollingFileSystemSinkWithSecureHdfs
Running org.apache.hadoop.security.TestPermission
Running org.apache.hadoop.tools.TestTools
Tests run: 5, Failures: 0, Errors: 0, Skipped: 0, Time elapsed: 1.57 sec - in org.apache.hadoop.tools.TestTools
Running org.apache.hadoop.tools.TestJMXGet
Tests run: 2, Failures: 0, Errors: 0, Skipped: 0, Time elapsed: 7.441 sec - in org.apache.hadoop.security.TestRefreshUserMappings
Running org.apache.hadoop.tools.TestHdfsConfigFields
Tests run: 3, Failures: 0, Errors: 0, Skipped: 0, Time elapsed: 0.866 sec - in org.apache.hadoop.tools.TestHdfsConfigFields
Running org.apache.hadoop.tracing.TestTracing
Tests run: 3, Failures: 0, Errors: 0, Skipped: 0, Time elapsed: 7.781 sec - in org.apache.hadoop.security.TestPermission
Running org.apache.hadoop.tracing.TestTraceAdmin
Tests run: 2, Failures: 0, Errors: 0, Skipped: 0, Time elapsed: 6.908 sec - in org.apache.hadoop.tools.TestJMXGet
Running org.apache.hadoop.tracing.TestTracingShortCircuitLocalRead
Tests run: 1, Failures: 0, Errors: 0, Skipped: 0, Time elapsed: 6.636 sec - in org.apache.hadoop.tracing.TestTracing
Running org.apache.hadoop.net.TestNetworkTopology
Tests run: 1, Failures: 0, Errors: 0, Skipped: 0, Time elapsed: 5.412 sec - in org.apache.hadoop.tracing.TestTraceAdmin
Running org.apache.hadoop.TestGenericRefresh
Tests run: 1, Failures: 0, Errors: 0, Skipped: 0, Time elapsed: 5.677 sec - in org.apache.hadoop.tracing.TestTracingShortCircuitLocalRead
Running org.apache.hadoop.cli.TestHDFSCLI
Tests run: 9, Failures: 0, Errors: 0, Skipped: 0, Time elapsed: 4.969 sec - in org.apache.hadoop.TestGenericRefresh
Running org.apache.hadoop.cli.TestCacheAdminCLI
Tests run: 12, Failures: 0, Errors: 0, Skipped: 0, Time elapsed: 10.16 sec - in org.apache.hadoop.net.TestNetworkTopology
Running org.apache.hadoop.cli.TestAclCLI
Tests run: 11, Failures: 0, Errors: 0, Skipped: 0, Time elapsed: 42.799 sec - in org.apache.hadoop.metrics2.sink.TestRollingFileSystemSinkWithHdfs
Running org.apache.hadoop.cli.TestErasureCodingCLI
Tests run: 1, Failures: 0, Errors: 0, Skipped: 0, Time elapsed: 7.802 sec - in org.apache.hadoop.cli.TestCacheAdminCLI
Running org.apache.hadoop.cli.TestCryptoAdminCLI
Tests run: 1, Failures: 0, Errors: 0, Skipped: 0, Time elapsed: 6.332 sec - in org.apache.hadoop.cli.TestAclCLI
Running org.apache.hadoop.cli.TestXAttrCLI
Tests run: 1, Failures: 0, Errors: 0, Skipped: 0, Time elapsed: 8.28 sec - in org.apache.hadoop.cli.TestErasureCodingCLI
Running org.apache.hadoop.cli.TestDeleteCLI
Tests run: 1, Failures: 0, Errors: 0, Skipped: 0, Time elapsed: 7.967 sec - in org.apache.hadoop.cli.TestCryptoAdminCLI
Tests run: 1, Failures: 0, Errors: 0, Skipped: 0, Time elapsed: 7.874 sec - in org.apache.hadoop.cli.TestXAttrCLI
Tests run: 1, Failures: 0, Errors: 0, Skipped: 0, Time elapsed: 7.277 sec - in org.apache.hadoop.cli.TestDeleteCLI
Tests run: 1, Failures: 0, Errors: 0, Skipped: 0, Time elapsed: 83.88 sec - in org.apache.hadoop.cli.TestHDFSCLI

Results :

Failed tests: 
  TestShortCircuitCache.testDataXceiverCleansUpSlotsOnFailure:682->checkNumberOfSegmentsAndSlots:628
expected:<1> but was:<2>

Tests in error: 
  TestDFSUpgradeFromImage.testUpgradeFromRel1BBWImage:628->upgradeAndVerify:606->verifyFileSystem:229->verifyDir:214->dfsOpenFileWithRetries:178
ยป IO

Tests run: 4430, Failures: 1, Errors: 1, Skipped: 17

[INFO]                                                                         
[INFO] ------------------------------------------------------------------------
[INFO] Skipping Apache Hadoop HDFS Native Client
[INFO] This project has been banned from the build due to previous failures.
[INFO] ------------------------------------------------------------------------
[INFO]                                                                         
[INFO] ------------------------------------------------------------------------
[INFO] Skipping Apache Hadoop HttpFS
[INFO] This project has been banned from the build due to previous failures.
[INFO] ------------------------------------------------------------------------
[INFO]                                                                         
[INFO] ------------------------------------------------------------------------
[INFO] Skipping Apache Hadoop HDFS BookKeeper Journal
[INFO] This project has been banned from the build due to previous failures.
[INFO] ------------------------------------------------------------------------
[INFO]                                                                         
[INFO] ------------------------------------------------------------------------
[INFO] Skipping Apache Hadoop HDFS-NFS
[INFO] This project has been banned from the build due to previous failures.
[INFO] ------------------------------------------------------------------------
[INFO]                                                                         
[INFO] ------------------------------------------------------------------------
[INFO] Building Apache Hadoop HDFS Project 3.0.0-alpha1-SNAPSHOT
[INFO] ------------------------------------------------------------------------
[INFO] 
[INFO] --- maven-clean-plugin:2.5:clean (default-clean) @ hadoop-hdfs-project ---
[INFO] Deleting <https://builds.apache.org/job/Hadoop-Hdfs-trunk-Java8/ws/source/hadoop-hdfs-project/target>
[INFO] 
[INFO] --- maven-antrun-plugin:1.7:run (create-testdirs) @ hadoop-hdfs-project ---
[INFO] Executing tasks

main:
    [mkdir] Created dir: <https://builds.apache.org/job/Hadoop-Hdfs-trunk-Java8/ws/source/hadoop-hdfs-project/target/test-dir>
[INFO] Executed tasks
[INFO] 
[INFO] --- maven-source-plugin:2.3:jar-no-fork (hadoop-java-sources) @ hadoop-hdfs-project
---
[INFO] 
[INFO] --- maven-source-plugin:2.3:test-jar-no-fork (hadoop-java-sources) @ hadoop-hdfs-project
---
[INFO] 
[INFO] --- maven-enforcer-plugin:1.3.1:enforce (dist-enforce) @ hadoop-hdfs-project ---
[INFO] 
[INFO] --- maven-site-plugin:3.5:attach-descriptor (attach-descriptor) @ hadoop-hdfs-project
---
[INFO] 
[INFO] --- maven-javadoc-plugin:2.8.1:jar (module-javadocs) @ hadoop-hdfs-project ---
[INFO] Not executing Javadoc as the project is not a Java classpath-capable package
[INFO] 
[INFO] --- maven-enforcer-plugin:1.3.1:enforce (depcheck) @ hadoop-hdfs-project ---
[INFO] 
[INFO] --- maven-checkstyle-plugin:2.15:checkstyle (default-cli) @ hadoop-hdfs-project ---
[INFO] 
[INFO] --- findbugs-maven-plugin:3.0.0:findbugs (default-cli) @ hadoop-hdfs-project ---
[INFO] ------------------------------------------------------------------------
[INFO] Reactor Summary:
[INFO] 
[INFO] Apache Hadoop HDFS Client .......................... SUCCESS [03:56 min]
[INFO] Apache Hadoop HDFS ................................. FAILURE [57:34 min]
[INFO] Apache Hadoop HDFS Native Client ................... SKIPPED
[INFO] Apache Hadoop HttpFS ............................... SKIPPED
[INFO] Apache Hadoop HDFS BookKeeper Journal .............. SKIPPED
[INFO] Apache Hadoop HDFS-NFS ............................. SKIPPED
[INFO] Apache Hadoop HDFS Project ......................... SUCCESS [  0.087 s]
[INFO] ------------------------------------------------------------------------
[INFO] BUILD FAILURE
[INFO] ------------------------------------------------------------------------
[INFO] Total time: 01:01 h
[INFO] Finished at: 2016-05-25T06:47:01+00:00
[INFO] Final Memory: 96M/3634M
[INFO] ------------------------------------------------------------------------
[ERROR] Failed to execute goal org.apache.maven.plugins:maven-surefire-plugin:2.17:test (default-test)
on project hadoop-hdfs: There are test failures.
[ERROR] 
[ERROR] Please refer to <https://builds.apache.org/job/Hadoop-Hdfs-trunk-Java8/ws/source/hadoop-hdfs-project/hadoop-hdfs/target/surefire-reports>
for the individual test results.
[ERROR] -> [Help 1]
[ERROR] 
[ERROR] To see the full stack trace of the errors, re-run Maven with the -e switch.
[ERROR] Re-run Maven using the -X switch to enable full debug logging.
[ERROR] 
[ERROR] For more information about the errors and possible solutions, please read the following
articles:
[ERROR] [Help 1] http://cwiki.apache.org/confluence/display/MAVEN/MojoFailureException
[ERROR] 
[ERROR] After correcting the problems, you can resume the build with the command
[ERROR]   mvn <goals> -rf :hadoop-hdfs
Build step 'Execute shell' marked build as failure
Archiving artifacts
Setting LATEST1_8_HOME=/home/jenkins/jenkins-slave/tools/hudson.model.JDK/latest1.8
Setting MAVEN_3_3_3_HOME=/home/jenkins/jenkins-slave/tools/hudson.tasks.Maven_MavenInstallation/maven-3.3.3
Recording test results
Setting LATEST1_8_HOME=/home/jenkins/jenkins-slave/tools/hudson.model.JDK/latest1.8
Setting MAVEN_3_3_3_HOME=/home/jenkins/jenkins-slave/tools/hudson.tasks.Maven_MavenInstallation/maven-3.3.3
Setting LATEST1_8_HOME=/home/jenkins/jenkins-slave/tools/hudson.model.JDK/latest1.8
Setting MAVEN_3_3_3_HOME=/home/jenkins/jenkins-slave/tools/hudson.tasks.Maven_MavenInstallation/maven-3.3.3

---------------------------------------------------------------------
To unsubscribe, e-mail: hdfs-dev-unsubscribe@hadoop.apache.org
For additional commands, e-mail: hdfs-dev-help@hadoop.apache.org


Mime
View raw message