hadoop-hdfs-dev mailing list archives

Site index · List index
Message view « Date » · « Thread »
Top « Date » · « Thread »
From Apache Jenkins Server <jenk...@builds.apache.org>
Subject Build failed in Jenkins: Hadoop-Hdfs-trunk-Java8 #1276
Date Fri, 27 May 2016 01:52:08 GMT
See <https://builds.apache.org/job/Hadoop-Hdfs-trunk-Java8/1276/changes>

Changes:

[epayne] YARN-5116. Failed to execute "yarn application". Contributed by Jun Gong

[zhz] HDFS-10236. Erasure Coding: Rename replication-based names in

------------------------------------------
[...truncated 5257 lines...]
Tests run: 30, Failures: 0, Errors: 0, Skipped: 0, Time elapsed: 0.754 sec - in org.apache.hadoop.hdfs.protocolPB.TestPBHelper
Running org.apache.hadoop.hdfs.TestEncryptedTransfer
Tests run: 10, Failures: 0, Errors: 0, Skipped: 0, Time elapsed: 91.7 sec - in org.apache.hadoop.hdfs.server.mover.TestMover
Running org.apache.hadoop.hdfs.TestPipelines
Tests run: 1, Failures: 0, Errors: 0, Skipped: 0, Time elapsed: 6.286 sec - in org.apache.hadoop.hdfs.TestPipelines
Running org.apache.hadoop.hdfs.TestHttpPolicy
Tests run: 1, Failures: 0, Errors: 0, Skipped: 0, Time elapsed: 0.647 sec - in org.apache.hadoop.hdfs.TestHttpPolicy
Running org.apache.hadoop.hdfs.TestEncryptionZonesWithHA
Tests run: 1, Failures: 0, Errors: 0, Skipped: 0, Time elapsed: 7.494 sec - in org.apache.hadoop.hdfs.TestEncryptionZonesWithHA
Running org.apache.hadoop.hdfs.TestDFSClientSocketSize
Tests run: 3, Failures: 0, Errors: 0, Skipped: 0, Time elapsed: 6.666 sec - in org.apache.hadoop.hdfs.TestDFSClientSocketSize
Running org.apache.hadoop.hdfs.TestWriteRead
Tests run: 3, Failures: 0, Errors: 0, Skipped: 0, Time elapsed: 24.605 sec - in org.apache.hadoop.hdfs.TestWriteRead
Running org.apache.hadoop.hdfs.TestDFSInotifyEventInputStream
Tests run: 5, Failures: 0, Errors: 0, Skipped: 0, Time elapsed: 19.994 sec - in org.apache.hadoop.hdfs.TestDFSInotifyEventInputStream
Running org.apache.hadoop.hdfs.TestClientProtocolForPipelineRecovery
Tests run: 6, Failures: 0, Errors: 0, Skipped: 0, Time elapsed: 189.949 sec - in org.apache.hadoop.hdfs.server.mover.TestStorageMover
Running org.apache.hadoop.hdfs.TestReplaceDatanodeOnFailure
Tests run: 4, Failures: 0, Errors: 0, Skipped: 0, Time elapsed: 10.273 sec - in org.apache.hadoop.hdfs.TestReplaceDatanodeOnFailure
Running org.apache.hadoop.hdfs.TestPersistBlocks
Tests run: 26, Failures: 0, Errors: 0, Skipped: 0, Time elapsed: 111.057 sec - in org.apache.hadoop.hdfs.TestEncryptedTransfer
Running org.apache.hadoop.hdfs.TestFSInputChecker
Tests run: 1, Failures: 0, Errors: 0, Skipped: 0, Time elapsed: 4.612 sec - in org.apache.hadoop.hdfs.TestFSInputChecker
Running org.apache.hadoop.hdfs.TestDFSStripedOutputStreamWithFailure170
Tests run: 5, Failures: 0, Errors: 0, Skipped: 0, Time elapsed: 23.593 sec - in org.apache.hadoop.hdfs.TestPersistBlocks
Running org.apache.hadoop.fs.TestFcHdfsSetUMask
Tests run: 12, Failures: 0, Errors: 0, Skipped: 0, Time elapsed: 6.107 sec - in org.apache.hadoop.fs.TestFcHdfsSetUMask
Running org.apache.hadoop.fs.TestFcHdfsPermission
Tests run: 4, Failures: 0, Errors: 0, Skipped: 0, Time elapsed: 5.12 sec - in org.apache.hadoop.fs.TestFcHdfsPermission
Tests run: 8, Failures: 0, Errors: 0, Skipped: 0, Time elapsed: 55.253 sec - in org.apache.hadoop.hdfs.TestClientProtocolForPipelineRecovery
Running org.apache.hadoop.fs.TestGlobPaths
Running org.apache.hadoop.fs.loadGenerator.TestLoadGenerator
Tests run: 37, Failures: 0, Errors: 0, Skipped: 6, Time elapsed: 5.777 sec - in org.apache.hadoop.fs.TestGlobPaths
Running org.apache.hadoop.fs.TestSymlinkHdfsDisable
Tests run: 1, Failures: 0, Errors: 0, Skipped: 0, Time elapsed: 4.965 sec - in org.apache.hadoop.fs.TestSymlinkHdfsDisable
Running org.apache.hadoop.fs.TestSymlinkHdfsFileSystem
Tests run: 2, Failures: 0, Errors: 0, Skipped: 0, Time elapsed: 16.057 sec - in org.apache.hadoop.fs.loadGenerator.TestLoadGenerator
Running org.apache.hadoop.fs.TestUrlStreamHandler
Tests run: 2, Failures: 0, Errors: 0, Skipped: 0, Time elapsed: 5.489 sec - in org.apache.hadoop.fs.TestUrlStreamHandler
Running org.apache.hadoop.fs.TestUnbuffer
Tests run: 10, Failures: 0, Errors: 0, Skipped: 0, Time elapsed: 45.231 sec - in org.apache.hadoop.hdfs.TestDFSStripedOutputStreamWithFailure170
Running org.apache.hadoop.fs.TestFcHdfsCreateMkdir
Tests run: 74, Failures: 0, Errors: 0, Skipped: 2, Time elapsed: 18.284 sec - in org.apache.hadoop.fs.TestSymlinkHdfsFileSystem
Tests run: 2, Failures: 0, Errors: 0, Skipped: 0, Time elapsed: 7.284 sec - in org.apache.hadoop.fs.TestUnbuffer
Running org.apache.hadoop.fs.TestEnhancedByteBufferAccess
Running org.apache.hadoop.fs.TestHdfsNativeCodeLoader
Tests run: 1, Failures: 0, Errors: 0, Skipped: 0, Time elapsed: 0.173 sec - in org.apache.hadoop.fs.TestHdfsNativeCodeLoader
Running org.apache.hadoop.fs.TestHDFSFileContextMainOperations
Tests run: 8, Failures: 0, Errors: 0, Skipped: 0, Time elapsed: 5.194 sec - in org.apache.hadoop.fs.TestFcHdfsCreateMkdir
Running org.apache.hadoop.fs.shell.TestHdfsTextCommand
Tests run: 1, Failures: 0, Errors: 0, Skipped: 0, Time elapsed: 5.737 sec - in org.apache.hadoop.fs.shell.TestHdfsTextCommand
Running org.apache.hadoop.fs.TestSWebHdfsFileContextMainOperations
Tests run: 69, Failures: 0, Errors: 0, Skipped: 0, Time elapsed: 15.196 sec - in org.apache.hadoop.fs.TestHDFSFileContextMainOperations
Running org.apache.hadoop.fs.TestResolveHdfsSymlink
Tests run: 10, Failures: 0, Errors: 0, Skipped: 1, Time elapsed: 16.607 sec - in org.apache.hadoop.fs.TestEnhancedByteBufferAccess
Running org.apache.hadoop.fs.TestWebHdfsFileContextMainOperations
Tests run: 4, Failures: 0, Errors: 0, Skipped: 0, Time elapsed: 4.931 sec - in org.apache.hadoop.fs.TestResolveHdfsSymlink
Tests run: 61, Failures: 0, Errors: 0, Skipped: 0, Time elapsed: 13.707 sec - in org.apache.hadoop.fs.TestSWebHdfsFileContextMainOperations
Running org.apache.hadoop.fs.viewfs.TestViewFsWithAcls
Running org.apache.hadoop.fs.viewfs.TestViewFsFileStatusHdfs
Tests run: 32, Failures: 0, Errors: 0, Skipped: 0, Time elapsed: 311.151 sec - in org.apache.hadoop.hdfs.server.balancer.TestBalancer
Running org.apache.hadoop.fs.viewfs.TestViewFileSystemHdfs
Tests run: 2, Failures: 0, Errors: 0, Skipped: 0, Time elapsed: 5.249 sec - in org.apache.hadoop.fs.viewfs.TestViewFsFileStatusHdfs
Tests run: 1, Failures: 0, Errors: 0, Skipped: 0, Time elapsed: 5.882 sec - in org.apache.hadoop.fs.viewfs.TestViewFsWithAcls
Running org.apache.hadoop.fs.viewfs.TestViewFsWithXAttrs
Running org.apache.hadoop.fs.viewfs.TestViewFsAtHdfsRoot
Tests run: 61, Failures: 0, Errors: 0, Skipped: 0, Time elapsed: 12.853 sec - in org.apache.hadoop.fs.TestWebHdfsFileContextMainOperations
Running org.apache.hadoop.fs.viewfs.TestViewFsHdfs
Tests run: 1, Failures: 0, Errors: 0, Skipped: 0, Time elapsed: 6.795 sec - in org.apache.hadoop.fs.viewfs.TestViewFsWithXAttrs
Running org.apache.hadoop.fs.viewfs.TestViewFileSystemWithAcls
Tests run: 1, Failures: 0, Errors: 0, Skipped: 0, Time elapsed: 5.685 sec - in org.apache.hadoop.fs.viewfs.TestViewFileSystemWithAcls
Tests run: 58, Failures: 0, Errors: 0, Skipped: 0, Time elapsed: 13.085 sec - in org.apache.hadoop.fs.viewfs.TestViewFsAtHdfsRoot
Running org.apache.hadoop.fs.viewfs.TestViewFileSystemAtHdfsRoot
Running org.apache.hadoop.fs.viewfs.TestViewFileSystemWithXAttrs
Tests run: 58, Failures: 0, Errors: 0, Skipped: 0, Time elapsed: 14.039 sec - in org.apache.hadoop.fs.viewfs.TestViewFsHdfs
Running org.apache.hadoop.fs.viewfs.TestViewFsDefaultValue
Tests run: 1, Failures: 0, Errors: 0, Skipped: 0, Time elapsed: 6.011 sec - in org.apache.hadoop.fs.viewfs.TestViewFileSystemWithXAttrs
Running org.apache.hadoop.fs.TestSymlinkHdfsFileContext
Tests run: 60, Failures: 0, Errors: 0, Skipped: 0, Time elapsed: 23.361 sec - in org.apache.hadoop.fs.viewfs.TestViewFileSystemHdfs
Running org.apache.hadoop.fs.contract.hdfs.TestHDFSContractDelete
Tests run: 7, Failures: 0, Errors: 0, Skipped: 0, Time elapsed: 5.159 sec - in org.apache.hadoop.fs.viewfs.TestViewFsDefaultValue
Running org.apache.hadoop.fs.contract.hdfs.TestHDFSContractSetTimes
Tests run: 8, Failures: 0, Errors: 0, Skipped: 0, Time elapsed: 5.785 sec - in org.apache.hadoop.fs.contract.hdfs.TestHDFSContractDelete
Tests run: 1, Failures: 0, Errors: 0, Skipped: 0, Time elapsed: 5.046 sec - in org.apache.hadoop.fs.contract.hdfs.TestHDFSContractSetTimes
Running org.apache.hadoop.fs.contract.hdfs.TestHDFSContractMkdir
Running org.apache.hadoop.fs.contract.hdfs.TestHDFSContractOpen
Tests run: 71, Failures: 0, Errors: 0, Skipped: 0, Time elapsed: 13.757 sec - in org.apache.hadoop.fs.TestSymlinkHdfsFileContext
Tests run: 5, Failures: 0, Errors: 0, Skipped: 0, Time elapsed: 5.869 sec - in org.apache.hadoop.fs.contract.hdfs.TestHDFSContractMkdir
Tests run: 6, Failures: 0, Errors: 0, Skipped: 0, Time elapsed: 5.791 sec - in org.apache.hadoop.fs.contract.hdfs.TestHDFSContractOpen
Running org.apache.hadoop.fs.contract.hdfs.TestHDFSContractRootDirectory
Running org.apache.hadoop.fs.contract.hdfs.TestHDFSContractAppend
Running org.apache.hadoop.fs.contract.hdfs.TestHDFSContractCreate
Tests run: 60, Failures: 0, Errors: 0, Skipped: 0, Time elapsed: 22.299 sec - in org.apache.hadoop.fs.viewfs.TestViewFileSystemAtHdfsRoot
Running org.apache.hadoop.fs.contract.hdfs.TestHDFSContractSeek
Tests run: 6, Failures: 0, Errors: 0, Skipped: 0, Time elapsed: 5.398 sec - in org.apache.hadoop.fs.contract.hdfs.TestHDFSContractRootDirectory
Running org.apache.hadoop.fs.contract.hdfs.TestHDFSContractRename
Tests run: 5, Failures: 0, Errors: 0, Skipped: 0, Time elapsed: 6.737 sec - in org.apache.hadoop.fs.contract.hdfs.TestHDFSContractAppend
Tests run: 6, Failures: 0, Errors: 0, Skipped: 0, Time elapsed: 6.896 sec - in org.apache.hadoop.fs.contract.hdfs.TestHDFSContractCreate
Running org.apache.hadoop.fs.contract.hdfs.TestHDFSContractGetFileStatus
Running org.apache.hadoop.fs.contract.hdfs.TestHDFSContractConcat
Tests run: 18, Failures: 0, Errors: 0, Skipped: 0, Time elapsed: 10.058 sec - in org.apache.hadoop.fs.contract.hdfs.TestHDFSContractSeek
Running org.apache.hadoop.fs.permission.TestStickyBit
Tests run: 6, Failures: 0, Errors: 0, Skipped: 0, Time elapsed: 6.817 sec - in org.apache.hadoop.fs.contract.hdfs.TestHDFSContractRename
Tests run: 2, Failures: 0, Errors: 0, Skipped: 0, Time elapsed: 5.376 sec - in org.apache.hadoop.fs.contract.hdfs.TestHDFSContractGetFileStatus
Running org.apache.hadoop.metrics2.sink.TestRollingFileSystemSinkWithHdfs
Running org.apache.hadoop.metrics2.sink.TestRollingFileSystemSinkWithSecureHdfs
Tests run: 4, Failures: 0, Errors: 0, Skipped: 0, Time elapsed: 6.158 sec - in org.apache.hadoop.fs.contract.hdfs.TestHDFSContractConcat
Running org.apache.hadoop.TestRefreshCallQueue
Tests run: 1, Failures: 0, Errors: 0, Skipped: 0, Time elapsed: 6.603 sec - in org.apache.hadoop.TestRefreshCallQueue
Running org.apache.hadoop.security.TestPermissionSymlinks
Tests run: 6, Failures: 0, Errors: 0, Skipped: 0, Time elapsed: 11.593 sec - in org.apache.hadoop.fs.permission.TestStickyBit
Running org.apache.hadoop.security.TestRefreshUserMappings
Tests run: 2, Failures: 0, Errors: 0, Skipped: 0, Time elapsed: 15.271 sec - in org.apache.hadoop.metrics2.sink.TestRollingFileSystemSinkWithSecureHdfs
Running org.apache.hadoop.security.TestPermission
Tests run: 15, Failures: 0, Errors: 0, Skipped: 0, Time elapsed: 7.669 sec - in org.apache.hadoop.security.TestPermissionSymlinks
Running org.apache.hadoop.tools.TestTools
Tests run: 2, Failures: 0, Errors: 0, Skipped: 0, Time elapsed: 7.059 sec - in org.apache.hadoop.security.TestRefreshUserMappings
Tests run: 5, Failures: 0, Errors: 0, Skipped: 0, Time elapsed: 1.477 sec - in org.apache.hadoop.tools.TestTools
Running org.apache.hadoop.tools.TestJMXGet
Running org.apache.hadoop.tools.TestHdfsConfigFields
Tests run: 3, Failures: 0, Errors: 0, Skipped: 0, Time elapsed: 0.803 sec - in org.apache.hadoop.tools.TestHdfsConfigFields
Running org.apache.hadoop.tracing.TestTracing
Tests run: 3, Failures: 0, Errors: 0, Skipped: 0, Time elapsed: 7.466 sec - in org.apache.hadoop.security.TestPermission
Running org.apache.hadoop.tracing.TestTraceAdmin
Tests run: 2, Failures: 0, Errors: 0, Skipped: 0, Time elapsed: 7.635 sec - in org.apache.hadoop.tools.TestJMXGet
Running org.apache.hadoop.tracing.TestTracingShortCircuitLocalRead
Tests run: 1, Failures: 0, Errors: 0, Skipped: 0, Time elapsed: 7.111 sec - in org.apache.hadoop.tracing.TestTracing
Running org.apache.hadoop.net.TestNetworkTopology
Tests run: 1, Failures: 0, Errors: 0, Skipped: 0, Time elapsed: 5.482 sec - in org.apache.hadoop.tracing.TestTraceAdmin
Running org.apache.hadoop.TestGenericRefresh
Tests run: 1, Failures: 0, Errors: 0, Skipped: 0, Time elapsed: 5.625 sec - in org.apache.hadoop.tracing.TestTracingShortCircuitLocalRead
Running org.apache.hadoop.cli.TestHDFSCLI
Tests run: 9, Failures: 0, Errors: 0, Skipped: 0, Time elapsed: 4.889 sec - in org.apache.hadoop.TestGenericRefresh
Running org.apache.hadoop.cli.TestCacheAdminCLI
Tests run: 12, Failures: 0, Errors: 0, Skipped: 0, Time elapsed: 10.193 sec - in org.apache.hadoop.net.TestNetworkTopology
Running org.apache.hadoop.cli.TestAclCLI
Tests run: 11, Failures: 0, Errors: 0, Skipped: 0, Time elapsed: 42.752 sec - in org.apache.hadoop.metrics2.sink.TestRollingFileSystemSinkWithHdfs
Running org.apache.hadoop.cli.TestErasureCodingCLI
Tests run: 1, Failures: 0, Errors: 0, Skipped: 0, Time elapsed: 7.847 sec - in org.apache.hadoop.cli.TestCacheAdminCLI
Running org.apache.hadoop.cli.TestCryptoAdminCLI
Tests run: 1, Failures: 0, Errors: 0, Skipped: 0, Time elapsed: 6.198 sec - in org.apache.hadoop.cli.TestAclCLI
Running org.apache.hadoop.cli.TestXAttrCLI
Tests run: 1, Failures: 0, Errors: 0, Skipped: 0, Time elapsed: 7.858 sec - in org.apache.hadoop.cli.TestErasureCodingCLI
Running org.apache.hadoop.cli.TestDeleteCLI
Tests run: 1, Failures: 0, Errors: 0, Skipped: 0, Time elapsed: 7.781 sec - in org.apache.hadoop.cli.TestCryptoAdminCLI
Tests run: 1, Failures: 0, Errors: 0, Skipped: 0, Time elapsed: 7.71 sec - in org.apache.hadoop.cli.TestXAttrCLI
Tests run: 1, Failures: 0, Errors: 0, Skipped: 0, Time elapsed: 7.539 sec - in org.apache.hadoop.cli.TestDeleteCLI
Tests run: 1, Failures: 0, Errors: 0, Skipped: 0, Time elapsed: 79.529 sec - in org.apache.hadoop.cli.TestHDFSCLI

Results :

Failed tests: 
  TestShortCircuitCache.testDataXceiverCleansUpSlotsOnFailure:682->checkNumberOfSegmentsAndSlots:628
expected:<1> but was:<2>

Tests in error: 
  TestDFSUpgradeFromImage.testUpgradeFromRel1BBWImage:628->upgradeAndVerify:606->verifyFileSystem:229->verifyDir:214->dfsOpenFileWithRetries:178
ยป IO

Tests run: 4425, Failures: 1, Errors: 1, Skipped: 17

[INFO]                                                                         
[INFO] ------------------------------------------------------------------------
[INFO] Skipping Apache Hadoop HDFS Native Client
[INFO] This project has been banned from the build due to previous failures.
[INFO] ------------------------------------------------------------------------
[INFO]                                                                         
[INFO] ------------------------------------------------------------------------
[INFO] Skipping Apache Hadoop HttpFS
[INFO] This project has been banned from the build due to previous failures.
[INFO] ------------------------------------------------------------------------
[INFO]                                                                         
[INFO] ------------------------------------------------------------------------
[INFO] Skipping Apache Hadoop HDFS BookKeeper Journal
[INFO] This project has been banned from the build due to previous failures.
[INFO] ------------------------------------------------------------------------
[INFO]                                                                         
[INFO] ------------------------------------------------------------------------
[INFO] Skipping Apache Hadoop HDFS-NFS
[INFO] This project has been banned from the build due to previous failures.
[INFO] ------------------------------------------------------------------------
[INFO]                                                                         
[INFO] ------------------------------------------------------------------------
[INFO] Building Apache Hadoop HDFS Project 3.0.0-alpha1-SNAPSHOT
[INFO] ------------------------------------------------------------------------
[INFO] 
[INFO] --- maven-clean-plugin:2.5:clean (default-clean) @ hadoop-hdfs-project ---
[INFO] Deleting <https://builds.apache.org/job/Hadoop-Hdfs-trunk-Java8/ws/source/hadoop-hdfs-project/target>
[INFO] 
[INFO] --- maven-antrun-plugin:1.7:run (create-testdirs) @ hadoop-hdfs-project ---
[INFO] Executing tasks

main:
    [mkdir] Created dir: <https://builds.apache.org/job/Hadoop-Hdfs-trunk-Java8/ws/source/hadoop-hdfs-project/target/test-dir>
[INFO] Executed tasks
[INFO] 
[INFO] --- maven-source-plugin:2.3:jar-no-fork (hadoop-java-sources) @ hadoop-hdfs-project
---
[INFO] 
[INFO] --- maven-source-plugin:2.3:test-jar-no-fork (hadoop-java-sources) @ hadoop-hdfs-project
---
[INFO] 
[INFO] --- maven-enforcer-plugin:1.3.1:enforce (dist-enforce) @ hadoop-hdfs-project ---
[INFO] 
[INFO] --- maven-site-plugin:3.5:attach-descriptor (attach-descriptor) @ hadoop-hdfs-project
---
[INFO] 
[INFO] --- maven-javadoc-plugin:2.8.1:jar (module-javadocs) @ hadoop-hdfs-project ---
[INFO] Not executing Javadoc as the project is not a Java classpath-capable package
[INFO] 
[INFO] --- maven-enforcer-plugin:1.3.1:enforce (depcheck) @ hadoop-hdfs-project ---
[INFO] 
[INFO] --- maven-checkstyle-plugin:2.15:checkstyle (default-cli) @ hadoop-hdfs-project ---
[INFO] 
[INFO] --- findbugs-maven-plugin:3.0.0:findbugs (default-cli) @ hadoop-hdfs-project ---
[INFO] ------------------------------------------------------------------------
[INFO] Reactor Summary:
[INFO] 
[INFO] Apache Hadoop HDFS Client .......................... SUCCESS [04:33 min]
[INFO] Apache Hadoop HDFS ................................. FAILURE [  01:01 h]
[INFO] Apache Hadoop HDFS Native Client ................... SKIPPED
[INFO] Apache Hadoop HttpFS ............................... SKIPPED
[INFO] Apache Hadoop HDFS BookKeeper Journal .............. SKIPPED
[INFO] Apache Hadoop HDFS-NFS ............................. SKIPPED
[INFO] Apache Hadoop HDFS Project ......................... SUCCESS [  0.123 s]
[INFO] ------------------------------------------------------------------------
[INFO] BUILD FAILURE
[INFO] ------------------------------------------------------------------------
[INFO] Total time: 01:06 h
[INFO] Finished at: 2016-05-27T01:51:55+00:00
[INFO] Final Memory: 97M/4018M
[INFO] ------------------------------------------------------------------------
[ERROR] Failed to execute goal org.apache.maven.plugins:maven-surefire-plugin:2.17:test (default-test)
on project hadoop-hdfs: There are test failures.
[ERROR] 
[ERROR] Please refer to <https://builds.apache.org/job/Hadoop-Hdfs-trunk-Java8/ws/source/hadoop-hdfs-project/hadoop-hdfs/target/surefire-reports>
for the individual test results.
[ERROR] -> [Help 1]
[ERROR] 
[ERROR] To see the full stack trace of the errors, re-run Maven with the -e switch.
[ERROR] Re-run Maven using the -X switch to enable full debug logging.
[ERROR] 
[ERROR] For more information about the errors and possible solutions, please read the following
articles:
[ERROR] [Help 1] http://cwiki.apache.org/confluence/display/MAVEN/MojoFailureException
[ERROR] 
[ERROR] After correcting the problems, you can resume the build with the command
[ERROR]   mvn <goals> -rf :hadoop-hdfs
Build step 'Execute shell' marked build as failure
Archiving artifacts
Setting LATEST1_8_HOME=/home/jenkins/jenkins-slave/tools/hudson.model.JDK/latest1.8
Setting MAVEN_3_3_3_HOME=/home/jenkins/jenkins-slave/tools/hudson.tasks.Maven_MavenInstallation/maven-3.3.3
Recording test results
Setting LATEST1_8_HOME=/home/jenkins/jenkins-slave/tools/hudson.model.JDK/latest1.8
Setting MAVEN_3_3_3_HOME=/home/jenkins/jenkins-slave/tools/hudson.tasks.Maven_MavenInstallation/maven-3.3.3
Setting LATEST1_8_HOME=/home/jenkins/jenkins-slave/tools/hudson.model.JDK/latest1.8
Setting MAVEN_3_3_3_HOME=/home/jenkins/jenkins-slave/tools/hudson.tasks.Maven_MavenInstallation/maven-3.3.3

---------------------------------------------------------------------
To unsubscribe, e-mail: hdfs-dev-unsubscribe@hadoop.apache.org
For additional commands, e-mail: hdfs-dev-help@hadoop.apache.org


Mime
View raw message