hadoop-hdfs-dev mailing list archives

Site index · List index
Message view « Date » · « Thread »
Top « Date » · « Thread »
From Apache Jenkins Server <jenk...@builds.apache.org>
Subject Hadoop-Hdfs-trunk-Java8 - Build # 1091 - Failure
Date Tue, 12 Apr 2016 18:25:59 GMT
See https://builds.apache.org/job/Hadoop-Hdfs-trunk-Java8/1091/

###################################################################################
########################## LAST 60 LINES OF THE CONSOLE ###########################
[...truncated 27949 lines...]
[INFO] --- maven-clean-plugin:2.5:clean (default-clean) @ hadoop-hdfs-project ---
[INFO] Deleting /home/jenkins/jenkins-slave/workspace/Hadoop-Hdfs-trunk-Java8/hadoop-hdfs-project/target
[INFO] 
[INFO] --- maven-antrun-plugin:1.7:run (create-testdirs) @ hadoop-hdfs-project ---
[INFO] Executing tasks

main:
    [mkdir] Created dir: /home/jenkins/jenkins-slave/workspace/Hadoop-Hdfs-trunk-Java8/hadoop-hdfs-project/target/test-dir
[INFO] Executed tasks
[INFO] 
[INFO] --- maven-source-plugin:2.3:jar-no-fork (hadoop-java-sources) @ hadoop-hdfs-project
---
[INFO] 
[INFO] --- maven-source-plugin:2.3:test-jar-no-fork (hadoop-java-sources) @ hadoop-hdfs-project
---
[INFO] 
[INFO] --- maven-enforcer-plugin:1.3.1:enforce (dist-enforce) @ hadoop-hdfs-project ---
[INFO] 
[INFO] --- maven-site-plugin:3.5:attach-descriptor (attach-descriptor) @ hadoop-hdfs-project
---
[INFO] 
[INFO] --- maven-javadoc-plugin:2.8.1:jar (module-javadocs) @ hadoop-hdfs-project ---
[INFO] Not executing Javadoc as the project is not a Java classpath-capable package
[INFO] 
[INFO] --- maven-enforcer-plugin:1.3.1:enforce (depcheck) @ hadoop-hdfs-project ---
[INFO] 
[INFO] --- maven-checkstyle-plugin:2.15:checkstyle (default-cli) @ hadoop-hdfs-project ---
[INFO] 
[INFO] --- findbugs-maven-plugin:3.0.0:findbugs (default-cli) @ hadoop-hdfs-project ---
[INFO] ------------------------------------------------------------------------
[INFO] Reactor Summary:
[INFO] 
[INFO] Apache Hadoop HDFS Client ......................... SUCCESS [04:30 min]
[INFO] Apache Hadoop HDFS ................................ FAILURE [  04:10 h]
[INFO] Apache Hadoop HDFS Native Client .................. SKIPPED
[INFO] Apache Hadoop HttpFS .............................. SKIPPED
[INFO] Apache Hadoop HDFS BookKeeper Journal ............. SKIPPED
[INFO] Apache Hadoop HDFS-NFS ............................ SKIPPED
[INFO] Apache Hadoop HDFS Project ........................ SUCCESS [  0.198 s]
[INFO] ------------------------------------------------------------------------
[INFO] BUILD FAILURE
[INFO] ------------------------------------------------------------------------
[INFO] Total time: 04:15 h
[INFO] Finished at: 2016-04-12T18:25:43+00:00
[INFO] Final Memory: 56M/444M
[INFO] ------------------------------------------------------------------------
[ERROR] Failed to execute goal org.apache.maven.plugins:maven-surefire-plugin:2.17:test (default-test)
on project hadoop-hdfs: There was a timeout or other error in the fork -> [Help 1]
[ERROR] 
[ERROR] To see the full stack trace of the errors, re-run Maven with the -e switch.
[ERROR] Re-run Maven using the -X switch to enable full debug logging.
[ERROR] 
[ERROR] For more information about the errors and possible solutions, please read the following
articles:
[ERROR] [Help 1] http://cwiki.apache.org/confluence/display/MAVEN/MojoFailureException
[ERROR] 
[ERROR] After correcting the problems, you can resume the build with the command
[ERROR]   mvn <goals> -rf :hadoop-hdfs
Build step 'Execute shell' marked build as failure
Archiving artifacts
Recording test results
Sending e-mails to: hdfs-dev@hadoop.apache.org
Email was triggered for: Failure - Any
Sending email for trigger: Failure - Any



###################################################################################
############################## FAILED TESTS (if any) ##############################
15 tests failed.
FAILED:  org.apache.hadoop.hdfs.TestDFSStripedOutputStreamWithFailure.testAddBlockWhenNoSufficientParityNumOfNodes

Error Message:
test timed out after 90000 milliseconds

Stack Trace:
java.lang.Exception: test timed out after 90000 milliseconds
	at org.apache.hadoop.hdfs.StripedFileTestUtil.readAll(StripedFileTestUtil.java:93)
	at org.apache.hadoop.hdfs.StripedFileTestUtil.assertSeekAndRead(StripedFileTestUtil.java:218)
	at org.apache.hadoop.hdfs.StripedFileTestUtil.verifySeek(StripedFileTestUtil.java:176)
	at org.apache.hadoop.hdfs.TestDFSStripedOutputStreamWithFailure.testAddBlockWhenNoSufficientParityNumOfNodes(TestDFSStripedOutputStreamWithFailure.java:310)


FAILED:  org.apache.hadoop.hdfs.TestDFSStripedOutputStreamWithFailure020.test4

Error Message:
failed, dn=2, length=458753java.io.IOException: Got error, status=ERROR, status message opReadBlock
BP-509520415-67.195.81.148-1460475546422:blk_-9223372036854775792_1002 received exception
java.io.IOException: BlockId -9223372036854775792 is not valid., for OP_READ_BLOCK, self=/127.0.0.1:42736,
remote=/127.0.0.1:53849, for file /127.0.0.1:53849:-9223372036854775792, for pool BP-509520415-67.195.81.148-1460475546422
block -9223372036854775792_1002
 at org.apache.hadoop.hdfs.protocol.datatransfer.DataTransferProtoUtil.checkBlockOpStatus(DataTransferProtoUtil.java:121)
 at org.apache.hadoop.hdfs.RemoteBlockReader2.checkSuccess(RemoteBlockReader2.java:443)
 at org.apache.hadoop.hdfs.RemoteBlockReader2.newBlockReader(RemoteBlockReader2.java:411)
 at org.apache.hadoop.hdfs.BlockReaderFactory.getRemoteBlockReader(BlockReaderFactory.java:846)
 at org.apache.hadoop.hdfs.BlockReaderFactory.getRemoteBlockReaderFromTcp(BlockReaderFactory.java:735)
 at org.apache.hadoop.hdfs.BlockReaderFactory.build(BlockReaderFactory.java:377)
 at org.apache.hadoop.hdfs.BlockReaderTestUtil.getBlockReader(BlockReaderTestUtil.java:216)
 at org.apache.hadoop.hdfs.StripedFileTestUtil.checkData(StripedFileTestUtil.java:440)
 at org.apache.hadoop.hdfs.TestDFSStripedOutputStreamWithFailure.runTest(TestDFSStripedOutputStreamWithFailure.java:436)
 at org.apache.hadoop.hdfs.TestDFSStripedOutputStreamWithFailure.runTest(TestDFSStripedOutputStreamWithFailure.java:322)
 at org.apache.hadoop.hdfs.TestDFSStripedOutputStreamWithFailure$TestBase.run(TestDFSStripedOutputStreamWithFailure.java:527)
 at org.apache.hadoop.hdfs.TestDFSStripedOutputStreamWithFailure$TestBase.test4(TestDFSStripedOutputStreamWithFailure.java:534)
 at sun.reflect.NativeMethodAccessorImpl.invoke0(Native Method)
 at sun.reflect.NativeMethodAccessorImpl.invoke(NativeMethodAccessorImpl.java:62)
 at sun.reflect.DelegatingMethodAccessorImpl.invoke(DelegatingMethodAccessorImpl.java:43)
 at java.lang.reflect.Method.invoke(Method.java:483)
 at org.junit.runners.model.FrameworkMethod$1.runReflectiveCall(FrameworkMethod.java:47)
 at org.junit.internal.runners.model.ReflectiveCallable.run(ReflectiveCallable.java:12)
 at org.junit.runners.model.FrameworkMethod.invokeExplosively(FrameworkMethod.java:44)
 at org.junit.internal.runners.statements.InvokeMethod.evaluate(InvokeMethod.java:17)
 at org.junit.internal.runners.statements.FailOnTimeout$StatementThread.run(FailOnTimeout.java:74)


Stack Trace:
java.lang.AssertionError: failed, dn=2, length=458753java.io.IOException: Got error, status=ERROR,
status message opReadBlock BP-509520415-67.195.81.148-1460475546422:blk_-9223372036854775792_1002
received exception java.io.IOException: BlockId -9223372036854775792 is not valid., for OP_READ_BLOCK,
self=/127.0.0.1:42736, remote=/127.0.0.1:53849, for file /127.0.0.1:53849:-9223372036854775792,
for pool BP-509520415-67.195.81.148-1460475546422 block -9223372036854775792_1002
	at org.apache.hadoop.hdfs.protocol.datatransfer.DataTransferProtoUtil.checkBlockOpStatus(DataTransferProtoUtil.java:121)
	at org.apache.hadoop.hdfs.RemoteBlockReader2.checkSuccess(RemoteBlockReader2.java:443)
	at org.apache.hadoop.hdfs.RemoteBlockReader2.newBlockReader(RemoteBlockReader2.java:411)
	at org.apache.hadoop.hdfs.BlockReaderFactory.getRemoteBlockReader(BlockReaderFactory.java:846)
	at org.apache.hadoop.hdfs.BlockReaderFactory.getRemoteBlockReaderFromTcp(BlockReaderFactory.java:735)
	at org.apache.hadoop.hdfs.BlockReaderFactory.build(BlockReaderFactory.java:377)
	at org.apache.hadoop.hdfs.BlockReaderTestUtil.getBlockReader(BlockReaderTestUtil.java:216)
	at org.apache.hadoop.hdfs.StripedFileTestUtil.checkData(StripedFileTestUtil.java:440)
	at org.apache.hadoop.hdfs.TestDFSStripedOutputStreamWithFailure.runTest(TestDFSStripedOutputStreamWithFailure.java:436)
	at org.apache.hadoop.hdfs.TestDFSStripedOutputStreamWithFailure.runTest(TestDFSStripedOutputStreamWithFailure.java:322)
	at org.apache.hadoop.hdfs.TestDFSStripedOutputStreamWithFailure$TestBase.run(TestDFSStripedOutputStreamWithFailure.java:527)
	at org.apache.hadoop.hdfs.TestDFSStripedOutputStreamWithFailure$TestBase.test4(TestDFSStripedOutputStreamWithFailure.java:534)
	at sun.reflect.NativeMethodAccessorImpl.invoke0(Native Method)
	at sun.reflect.NativeMethodAccessorImpl.invoke(NativeMethodAccessorImpl.java:62)
	at sun.reflect.DelegatingMethodAccessorImpl.invoke(DelegatingMethodAccessorImpl.java:43)
	at java.lang.reflect.Method.invoke(Method.java:483)
	at org.junit.runners.model.FrameworkMethod$1.runReflectiveCall(FrameworkMethod.java:47)
	at org.junit.internal.runners.model.ReflectiveCallable.run(ReflectiveCallable.java:12)
	at org.junit.runners.model.FrameworkMethod.invokeExplosively(FrameworkMethod.java:44)
	at org.junit.internal.runners.statements.InvokeMethod.evaluate(InvokeMethod.java:17)
	at org.junit.internal.runners.statements.FailOnTimeout$StatementThread.run(FailOnTimeout.java:74)

	at org.junit.Assert.fail(Assert.java:88)
	at org.apache.hadoop.hdfs.TestDFSStripedOutputStreamWithFailure.runTest(TestDFSStripedOutputStreamWithFailure.java:327)
	at org.apache.hadoop.hdfs.TestDFSStripedOutputStreamWithFailure$TestBase.run(TestDFSStripedOutputStreamWithFailure.java:527)
	at org.apache.hadoop.hdfs.TestDFSStripedOutputStreamWithFailure$TestBase.test4(TestDFSStripedOutputStreamWithFailure.java:534)
	at sun.reflect.NativeMethodAccessorImpl.invoke0(Native Method)
	at sun.reflect.NativeMethodAccessorImpl.invoke(NativeMethodAccessorImpl.java:62)
	at sun.reflect.DelegatingMethodAccessorImpl.invoke(DelegatingMethodAccessorImpl.java:43)
	at java.lang.reflect.Method.invoke(Method.java:483)
	at org.junit.runners.model.FrameworkMethod$1.runReflectiveCall(FrameworkMethod.java:47)
	at org.junit.internal.runners.model.ReflectiveCallable.run(ReflectiveCallable.java:12)
	at org.junit.runners.model.FrameworkMethod.invokeExplosively(FrameworkMethod.java:44)
	at org.junit.internal.runners.statements.InvokeMethod.evaluate(InvokeMethod.java:17)
	at org.junit.internal.runners.statements.FailOnTimeout$StatementThread.run(FailOnTimeout.java:74)


FAILED:  org.apache.hadoop.hdfs.TestDFSStripedOutputStreamWithFailure150.test9

Error Message:
failed, dn=2, length=3407873java.io.IOException: Failed at i=1967615
 at org.apache.hadoop.hdfs.TestDFSStripedOutputStreamWithFailure.write(TestDFSStripedOutputStreamWithFailure.java:443)
 at org.apache.hadoop.hdfs.TestDFSStripedOutputStreamWithFailure.runTest(TestDFSStripedOutputStreamWithFailure.java:419)
 at org.apache.hadoop.hdfs.TestDFSStripedOutputStreamWithFailure.runTest(TestDFSStripedOutputStreamWithFailure.java:322)
 at org.apache.hadoop.hdfs.TestDFSStripedOutputStreamWithFailure$TestBase.run(TestDFSStripedOutputStreamWithFailure.java:527)
 at org.apache.hadoop.hdfs.TestDFSStripedOutputStreamWithFailure$TestBase.test9(TestDFSStripedOutputStreamWithFailure.java:539)
 at sun.reflect.NativeMethodAccessorImpl.invoke0(Native Method)
 at sun.reflect.NativeMethodAccessorImpl.invoke(NativeMethodAccessorImpl.java:62)
 at sun.reflect.DelegatingMethodAccessorImpl.invoke(DelegatingMethodAccessorImpl.java:43)
 at java.lang.reflect.Method.invoke(Method.java:483)
 at org.junit.runners.model.FrameworkMethod$1.runReflectiveCall(FrameworkMethod.java:47)
 at org.junit.internal.runners.model.ReflectiveCallable.run(ReflectiveCallable.java:12)
 at org.junit.runners.model.FrameworkMethod.invokeExplosively(FrameworkMethod.java:44)
 at org.junit.internal.runners.statements.InvokeMethod.evaluate(InvokeMethod.java:17)
 at org.junit.internal.runners.statements.FailOnTimeout$StatementThread.run(FailOnTimeout.java:74)
Caused by: java.io.IOException: Failed: the number of failed blocks = 5 > the number of
data blocks = 3
 at org.apache.hadoop.hdfs.DFSStripedOutputStream.checkStreamers(DFSStripedOutputStream.java:376)
 at org.apache.hadoop.hdfs.DFSStripedOutputStream.checkStreamerFailures(DFSStripedOutputStream.java:604)
 at org.apache.hadoop.hdfs.DFSStripedOutputStream.writeChunk(DFSStripedOutputStream.java:547)
 at org.apache.hadoop.fs.FSOutputSummer.writeChecksumChunks(FSOutputSummer.java:217)
 at org.apache.hadoop.fs.FSOutputSummer.flushBuffer(FSOutputSummer.java:164)
 at org.apache.hadoop.fs.FSOutputSummer.flushBuffer(FSOutputSummer.java:145)
 at org.apache.hadoop.fs.FSOutputSummer.write(FSOutputSummer.java:79)
 at org.apache.hadoop.fs.FSDataOutputStream$PositionCache.write(FSDataOutputStream.java:48)
 at java.io.DataOutputStream.write(DataOutputStream.java:88)
 at org.apache.hadoop.hdfs.TestDFSStripedOutputStreamWithFailure.write(TestDFSStripedOutputStreamWithFailure.java:441)
 ... 13 more


Stack Trace:
java.lang.AssertionError: failed, dn=2, length=3407873java.io.IOException: Failed at i=1967615
	at org.apache.hadoop.hdfs.TestDFSStripedOutputStreamWithFailure.write(TestDFSStripedOutputStreamWithFailure.java:443)
	at org.apache.hadoop.hdfs.TestDFSStripedOutputStreamWithFailure.runTest(TestDFSStripedOutputStreamWithFailure.java:419)
	at org.apache.hadoop.hdfs.TestDFSStripedOutputStreamWithFailure.runTest(TestDFSStripedOutputStreamWithFailure.java:322)
	at org.apache.hadoop.hdfs.TestDFSStripedOutputStreamWithFailure$TestBase.run(TestDFSStripedOutputStreamWithFailure.java:527)
	at org.apache.hadoop.hdfs.TestDFSStripedOutputStreamWithFailure$TestBase.test9(TestDFSStripedOutputStreamWithFailure.java:539)
	at sun.reflect.NativeMethodAccessorImpl.invoke0(Native Method)
	at sun.reflect.NativeMethodAccessorImpl.invoke(NativeMethodAccessorImpl.java:62)
	at sun.reflect.DelegatingMethodAccessorImpl.invoke(DelegatingMethodAccessorImpl.java:43)
	at java.lang.reflect.Method.invoke(Method.java:483)
	at org.junit.runners.model.FrameworkMethod$1.runReflectiveCall(FrameworkMethod.java:47)
	at org.junit.internal.runners.model.ReflectiveCallable.run(ReflectiveCallable.java:12)
	at org.junit.runners.model.FrameworkMethod.invokeExplosively(FrameworkMethod.java:44)
	at org.junit.internal.runners.statements.InvokeMethod.evaluate(InvokeMethod.java:17)
	at org.junit.internal.runners.statements.FailOnTimeout$StatementThread.run(FailOnTimeout.java:74)
Caused by: java.io.IOException: Failed: the number of failed blocks = 5 > the number of
data blocks = 3
	at org.apache.hadoop.hdfs.DFSStripedOutputStream.checkStreamers(DFSStripedOutputStream.java:376)
	at org.apache.hadoop.hdfs.DFSStripedOutputStream.checkStreamerFailures(DFSStripedOutputStream.java:604)
	at org.apache.hadoop.hdfs.DFSStripedOutputStream.writeChunk(DFSStripedOutputStream.java:547)
	at org.apache.hadoop.fs.FSOutputSummer.writeChecksumChunks(FSOutputSummer.java:217)
	at org.apache.hadoop.fs.FSOutputSummer.flushBuffer(FSOutputSummer.java:164)
	at org.apache.hadoop.fs.FSOutputSummer.flushBuffer(FSOutputSummer.java:145)
	at org.apache.hadoop.fs.FSOutputSummer.write(FSOutputSummer.java:79)
	at org.apache.hadoop.fs.FSDataOutputStream$PositionCache.write(FSDataOutputStream.java:48)
	at java.io.DataOutputStream.write(DataOutputStream.java:88)
	at org.apache.hadoop.hdfs.TestDFSStripedOutputStreamWithFailure.write(TestDFSStripedOutputStreamWithFailure.java:441)
	... 13 more

	at org.junit.Assert.fail(Assert.java:88)
	at org.apache.hadoop.hdfs.TestDFSStripedOutputStreamWithFailure.runTest(TestDFSStripedOutputStreamWithFailure.java:327)
	at org.apache.hadoop.hdfs.TestDFSStripedOutputStreamWithFailure$TestBase.run(TestDFSStripedOutputStreamWithFailure.java:527)
	at org.apache.hadoop.hdfs.TestDFSStripedOutputStreamWithFailure$TestBase.test9(TestDFSStripedOutputStreamWithFailure.java:539)
	at sun.reflect.NativeMethodAccessorImpl.invoke0(Native Method)
	at sun.reflect.NativeMethodAccessorImpl.invoke(NativeMethodAccessorImpl.java:62)
	at sun.reflect.DelegatingMethodAccessorImpl.invoke(DelegatingMethodAccessorImpl.java:43)
	at java.lang.reflect.Method.invoke(Method.java:483)
	at org.junit.runners.model.FrameworkMethod$1.runReflectiveCall(FrameworkMethod.java:47)
	at org.junit.internal.runners.model.ReflectiveCallable.run(ReflectiveCallable.java:12)
	at org.junit.runners.model.FrameworkMethod.invokeExplosively(FrameworkMethod.java:44)
	at org.junit.internal.runners.statements.InvokeMethod.evaluate(InvokeMethod.java:17)
	at org.junit.internal.runners.statements.FailOnTimeout$StatementThread.run(FailOnTimeout.java:74)


FAILED:  org.apache.hadoop.hdfs.TestDistributedFileSystem.testDFSClientPeerWriteTimeout

Error Message:
write timedout too late in 1370 ms.

Stack Trace:
java.io.IOException: write timedout too late in 1370 ms.
	at org.apache.hadoop.net.SocketIOWithTimeout.doIO(SocketIOWithTimeout.java:164)
	at org.apache.hadoop.net.SocketOutputStream.write(SocketOutputStream.java:159)
	at org.apache.hadoop.net.SocketOutputStream.write(SocketOutputStream.java:117)
	at java.io.OutputStream.write(OutputStream.java:75)
	at org.apache.hadoop.hdfs.TestDistributedFileSystem.testDFSClientPeerWriteTimeout(TestDistributedFileSystem.java:1102)


FAILED:  org.apache.hadoop.hdfs.TestHFlush.testHFlushInterrupted

Error Message:
The stream is closed

Stack Trace:
java.io.IOException: The stream is closed
	at org.apache.hadoop.net.SocketOutputStream.write(SocketOutputStream.java:118)
	at java.io.BufferedOutputStream.flushBuffer(BufferedOutputStream.java:82)
	at java.io.BufferedOutputStream.flush(BufferedOutputStream.java:140)
	at java.io.DataOutputStream.flush(DataOutputStream.java:123)
	at java.io.FilterOutputStream.close(FilterOutputStream.java:158)
	at org.apache.hadoop.hdfs.DataStreamer.closeStream(DataStreamer.java:877)
	at org.apache.hadoop.hdfs.DataStreamer.closeInternal(DataStreamer.java:726)
	at org.apache.hadoop.hdfs.DataStreamer.run(DataStreamer.java:721)


FAILED:  org.apache.hadoop.hdfs.server.balancer.TestBalancer.testBalancerWithStripedFile

Error Message:
expected:<0> but was:<-3>

Stack Trace:
java.lang.AssertionError: expected:<0> but was:<-3>
	at org.junit.Assert.fail(Assert.java:88)
	at org.junit.Assert.failNotEquals(Assert.java:743)
	at org.junit.Assert.assertEquals(Assert.java:118)
	at org.junit.Assert.assertEquals(Assert.java:555)
	at org.junit.Assert.assertEquals(Assert.java:542)
	at org.apache.hadoop.hdfs.server.balancer.TestBalancer.runBalancer(TestBalancer.java:896)
	at org.apache.hadoop.hdfs.server.balancer.TestBalancer.doTestBalancerWithStripedFile(TestBalancer.java:1927)
	at org.apache.hadoop.hdfs.server.balancer.TestBalancer.testBalancerWithStripedFile(TestBalancer.java:1878)


FAILED:  org.apache.hadoop.hdfs.server.blockmanagement.TestBlockManagerSafeMode.testCheckSafeMode

Error Message:
expected:<EXTENSION> but was:<OFF>

Stack Trace:
java.lang.AssertionError: expected:<EXTENSION> but was:<OFF>
	at org.junit.Assert.fail(Assert.java:88)
	at org.junit.Assert.failNotEquals(Assert.java:743)
	at org.junit.Assert.assertEquals(Assert.java:118)
	at org.junit.Assert.assertEquals(Assert.java:144)
	at org.apache.hadoop.hdfs.server.blockmanagement.TestBlockManagerSafeMode.testCheckSafeMode(TestBlockManagerSafeMode.java:159)


FAILED:  org.apache.hadoop.hdfs.server.datanode.TestBlockRecovery.testRecoverAppendDoesNotHoldLock

Error Message:
Cannot delete data-node dirs

Stack Trace:
java.lang.AssertionError: Cannot delete data-node dirs
	at org.junit.Assert.fail(Assert.java:88)
	at org.junit.Assert.assertTrue(Assert.java:41)
	at org.apache.hadoop.hdfs.server.datanode.TestBlockRecovery.tearDown(TestBlockRecovery.java:278)


FAILED:  org.apache.hadoop.hdfs.tools.TestDFSAdminWithHA.testRefreshSuperUserGroupsConfiguration

Error Message:
No valid image files found

Stack Trace:
java.io.FileNotFoundException: No valid image files found
	at org.apache.hadoop.hdfs.server.namenode.FSImageTransactionalStorageInspector.getLatestImages(FSImageTransactionalStorageInspector.java:158)
	at org.apache.hadoop.hdfs.server.namenode.FSImage.loadFSImage(FSImage.java:619)
	at org.apache.hadoop.hdfs.server.namenode.FSImage.recoverTransitionRead(FSImage.java:290)
	at org.apache.hadoop.hdfs.server.namenode.FSNamesystem.loadFSImage(FSNamesystem.java:960)
	at org.apache.hadoop.hdfs.server.namenode.FSNamesystem.loadFromDisk(FSNamesystem.java:659)
	at org.apache.hadoop.hdfs.server.namenode.NameNode.loadNamesystem(NameNode.java:637)
	at org.apache.hadoop.hdfs.server.namenode.NameNode.initialize(NameNode.java:699)
	at org.apache.hadoop.hdfs.server.namenode.NameNode.<init>(NameNode.java:900)
	at org.apache.hadoop.hdfs.server.namenode.NameNode.<init>(NameNode.java:879)
	at org.apache.hadoop.hdfs.server.namenode.NameNode.createNameNode(NameNode.java:1596)
	at org.apache.hadoop.hdfs.MiniDFSCluster.createNameNode(MiniDFSCluster.java:1247)
	at org.apache.hadoop.hdfs.MiniDFSCluster.configureNameService(MiniDFSCluster.java:1016)
	at org.apache.hadoop.hdfs.MiniDFSCluster.createNameNodesAndSetConf(MiniDFSCluster.java:891)
	at org.apache.hadoop.hdfs.MiniDFSCluster.initMiniDFSCluster(MiniDFSCluster.java:823)
	at org.apache.hadoop.hdfs.MiniDFSCluster.<init>(MiniDFSCluster.java:482)
	at org.apache.hadoop.hdfs.MiniDFSCluster$Builder.build(MiniDFSCluster.java:441)
	at org.apache.hadoop.hdfs.qjournal.MiniQJMHACluster.<init>(MiniQJMHACluster.java:114)
	at org.apache.hadoop.hdfs.qjournal.MiniQJMHACluster.<init>(MiniQJMHACluster.java:37)
	at org.apache.hadoop.hdfs.qjournal.MiniQJMHACluster$Builder.build(MiniQJMHACluster.java:64)
	at org.apache.hadoop.hdfs.tools.TestDFSAdminWithHA.setUpHaCluster(TestDFSAdminWithHA.java:84)
	at org.apache.hadoop.hdfs.tools.TestDFSAdminWithHA.testRefreshSuperUserGroupsConfiguration(TestDFSAdminWithHA.java:233)


FAILED:  org.apache.hadoop.hdfs.tools.TestDFSAdminWithHA.testRefreshNodes

Error Message:
No valid image files found

Stack Trace:
java.io.FileNotFoundException: No valid image files found
	at org.apache.hadoop.hdfs.server.namenode.FSImageTransactionalStorageInspector.getLatestImages(FSImageTransactionalStorageInspector.java:158)
	at org.apache.hadoop.hdfs.server.namenode.FSImage.loadFSImage(FSImage.java:619)
	at org.apache.hadoop.hdfs.server.namenode.FSImage.recoverTransitionRead(FSImage.java:290)
	at org.apache.hadoop.hdfs.server.namenode.FSNamesystem.loadFSImage(FSNamesystem.java:960)
	at org.apache.hadoop.hdfs.server.namenode.FSNamesystem.loadFromDisk(FSNamesystem.java:659)
	at org.apache.hadoop.hdfs.server.namenode.NameNode.loadNamesystem(NameNode.java:637)
	at org.apache.hadoop.hdfs.server.namenode.NameNode.initialize(NameNode.java:699)
	at org.apache.hadoop.hdfs.server.namenode.NameNode.<init>(NameNode.java:900)
	at org.apache.hadoop.hdfs.server.namenode.NameNode.<init>(NameNode.java:879)
	at org.apache.hadoop.hdfs.server.namenode.NameNode.createNameNode(NameNode.java:1596)
	at org.apache.hadoop.hdfs.MiniDFSCluster.createNameNode(MiniDFSCluster.java:1247)
	at org.apache.hadoop.hdfs.MiniDFSCluster.configureNameService(MiniDFSCluster.java:1016)
	at org.apache.hadoop.hdfs.MiniDFSCluster.createNameNodesAndSetConf(MiniDFSCluster.java:891)
	at org.apache.hadoop.hdfs.MiniDFSCluster.initMiniDFSCluster(MiniDFSCluster.java:823)
	at org.apache.hadoop.hdfs.MiniDFSCluster.<init>(MiniDFSCluster.java:482)
	at org.apache.hadoop.hdfs.MiniDFSCluster$Builder.build(MiniDFSCluster.java:441)
	at org.apache.hadoop.hdfs.qjournal.MiniQJMHACluster.<init>(MiniQJMHACluster.java:114)
	at org.apache.hadoop.hdfs.qjournal.MiniQJMHACluster.<init>(MiniQJMHACluster.java:37)
	at org.apache.hadoop.hdfs.qjournal.MiniQJMHACluster$Builder.build(MiniQJMHACluster.java:64)
	at org.apache.hadoop.hdfs.tools.TestDFSAdminWithHA.setUpHaCluster(TestDFSAdminWithHA.java:84)
	at org.apache.hadoop.hdfs.tools.TestDFSAdminWithHA.testRefreshNodes(TestDFSAdminWithHA.java:180)


FAILED:  org.apache.hadoop.hdfs.tools.TestDFSAdminWithHA.testRefreshCallQueue

Error Message:
Cannot lock storage /home/jenkins/jenkins-slave/workspace/Hadoop-Hdfs-trunk-Java8/hadoop-hdfs-project/hadoop-hdfs/target/test/data/dfs/name-0-1.
The directory is already locked

Stack Trace:
java.io.IOException: Cannot lock storage /home/jenkins/jenkins-slave/workspace/Hadoop-Hdfs-trunk-Java8/hadoop-hdfs-project/hadoop-hdfs/target/test/data/dfs/name-0-1.
The directory is already locked
	at org.apache.hadoop.hdfs.server.common.Storage$StorageDirectory.lock(Storage.java:699)
	at org.apache.hadoop.hdfs.server.common.Storage$StorageDirectory.analyzeStorage(Storage.java:514)
	at org.apache.hadoop.hdfs.server.namenode.FSImage.recoverStorageDirs(FSImage.java:318)
	at org.apache.hadoop.hdfs.server.namenode.FSImage.recoverTransitionRead(FSImage.java:211)
	at org.apache.hadoop.hdfs.server.namenode.FSNamesystem.loadFSImage(FSNamesystem.java:960)
	at org.apache.hadoop.hdfs.server.namenode.FSNamesystem.loadFromDisk(FSNamesystem.java:659)
	at org.apache.hadoop.hdfs.server.namenode.NameNode.loadNamesystem(NameNode.java:637)
	at org.apache.hadoop.hdfs.server.namenode.NameNode.initialize(NameNode.java:699)
	at org.apache.hadoop.hdfs.server.namenode.NameNode.<init>(NameNode.java:900)
	at org.apache.hadoop.hdfs.server.namenode.NameNode.<init>(NameNode.java:879)
	at org.apache.hadoop.hdfs.server.namenode.NameNode.createNameNode(NameNode.java:1596)
	at org.apache.hadoop.hdfs.MiniDFSCluster.restartNameNode(MiniDFSCluster.java:2020)
	at org.apache.hadoop.hdfs.MiniDFSCluster.restartNameNodes(MiniDFSCluster.java:1975)
	at org.apache.hadoop.hdfs.qjournal.MiniQJMHACluster.<init>(MiniQJMHACluster.java:127)
	at org.apache.hadoop.hdfs.qjournal.MiniQJMHACluster.<init>(MiniQJMHACluster.java:37)
	at org.apache.hadoop.hdfs.qjournal.MiniQJMHACluster$Builder.build(MiniQJMHACluster.java:64)
	at org.apache.hadoop.hdfs.tools.TestDFSAdminWithHA.setUpHaCluster(TestDFSAdminWithHA.java:84)
	at org.apache.hadoop.hdfs.tools.TestDFSAdminWithHA.testRefreshCallQueue(TestDFSAdminWithHA.java:243)


FAILED:  org.apache.hadoop.hdfs.TestReadStripedFileWithMissingBlocks.testReadFileWithMissingBlocks

Error Message:
test timed out after 300000 milliseconds

Stack Trace:
java.lang.Exception: test timed out after 300000 milliseconds
	at java.io.DataInputStream.read(DataInputStream.java:149)
	at org.apache.hadoop.hdfs.StripedFileTestUtil.readAll(StripedFileTestUtil.java:91)
	at org.apache.hadoop.hdfs.StripedFileTestUtil.assertSeekAndRead(StripedFileTestUtil.java:218)
	at org.apache.hadoop.hdfs.StripedFileTestUtil.verifySeek(StripedFileTestUtil.java:176)
	at org.apache.hadoop.hdfs.TestReadStripedFileWithMissingBlocks.readFileWithMissingBlocks(TestReadStripedFileWithMissingBlocks.java:115)
	at org.apache.hadoop.hdfs.TestReadStripedFileWithMissingBlocks.testReadFileWithMissingBlocks(TestReadStripedFileWithMissingBlocks.java:78)


FAILED:  org.apache.hadoop.hdfs.shortcircuit.TestShortCircuitLocalRead.testSmallFileLocalRead

Error Message:
Requested more bytes than destination buffer size

Stack Trace:
java.lang.IndexOutOfBoundsException: Requested more bytes than destination buffer size
	at org.apache.hadoop.fs.FSInputStream.validatePositionedReadArgs(FSInputStream.java:107)
	at org.apache.hadoop.hdfs.DFSInputStream.read(DFSInputStream.java:975)
	at java.io.DataInputStream.read(DataInputStream.java:149)
	at org.apache.hadoop.hdfs.shortcircuit.TestShortCircuitLocalRead.checkFileContent(TestShortCircuitLocalRead.java:157)
	at org.apache.hadoop.hdfs.shortcircuit.TestShortCircuitLocalRead.doTestShortCircuitReadImpl(TestShortCircuitLocalRead.java:286)
	at org.apache.hadoop.hdfs.shortcircuit.TestShortCircuitLocalRead.doTestShortCircuitRead(TestShortCircuitLocalRead.java:241)
	at org.apache.hadoop.hdfs.shortcircuit.TestShortCircuitLocalRead.testSmallFileLocalRead(TestShortCircuitLocalRead.java:308)


FAILED:  org.apache.hadoop.hdfs.shortcircuit.TestShortCircuitLocalRead.testLocalReadLegacy

Error Message:
Requested more bytes than destination buffer size

Stack Trace:
java.lang.IndexOutOfBoundsException: Requested more bytes than destination buffer size
	at org.apache.hadoop.fs.FSInputStream.validatePositionedReadArgs(FSInputStream.java:107)
	at org.apache.hadoop.hdfs.DFSInputStream.read(DFSInputStream.java:975)
	at java.io.DataInputStream.read(DataInputStream.java:149)
	at org.apache.hadoop.hdfs.shortcircuit.TestShortCircuitLocalRead.checkFileContent(TestShortCircuitLocalRead.java:157)
	at org.apache.hadoop.hdfs.shortcircuit.TestShortCircuitLocalRead.doTestShortCircuitReadImpl(TestShortCircuitLocalRead.java:286)
	at org.apache.hadoop.hdfs.shortcircuit.TestShortCircuitLocalRead.doTestShortCircuitReadLegacy(TestShortCircuitLocalRead.java:235)
	at org.apache.hadoop.hdfs.shortcircuit.TestShortCircuitLocalRead.testLocalReadLegacy(TestShortCircuitLocalRead.java:316)


FAILED:  org.apache.hadoop.hdfs.shortcircuit.TestShortCircuitLocalRead.testLocalReadFallback

Error Message:
Requested more bytes than destination buffer size

Stack Trace:
java.lang.IndexOutOfBoundsException: Requested more bytes than destination buffer size
	at org.apache.hadoop.fs.FSInputStream.validatePositionedReadArgs(FSInputStream.java:107)
	at org.apache.hadoop.hdfs.DFSInputStream.read(DFSInputStream.java:975)
	at java.io.DataInputStream.read(DataInputStream.java:149)
	at org.apache.hadoop.hdfs.shortcircuit.TestShortCircuitLocalRead.checkFileContent(TestShortCircuitLocalRead.java:157)
	at org.apache.hadoop.hdfs.shortcircuit.TestShortCircuitLocalRead.doTestShortCircuitReadImpl(TestShortCircuitLocalRead.java:286)
	at org.apache.hadoop.hdfs.shortcircuit.TestShortCircuitLocalRead.doTestShortCircuitReadLegacy(TestShortCircuitLocalRead.java:235)
	at org.apache.hadoop.hdfs.shortcircuit.TestShortCircuitLocalRead.testLocalReadFallback(TestShortCircuitLocalRead.java:327)



Mime
  • Unnamed multipart/mixed (inline, None, 0 bytes)
View raw message